{"text_format":"1","workbook":"xlsx","n_sheets":10,"sheets":["入力シート","出力シート","入力方法等のご案内","送付先指定について","宛先兼チェックリスト","入力例","【参考】将来の受取利息額","単年利率入力","ﾌﾟﾙﾀﾞｳﾝﾘｽﾄ","郵便番号"],"not_rendered":{"charts":0,"images":3,"macros":1,"external_links":0,"defined_names":7,"comments":2,"pivot_tables":0},"unopened":[],"bounds":{"document_bytes":16777216,"sheet_cells":100000,"rows_first":2000,"rows_last":500,"rows_between":2000,"halvings":0,"cell_chars":16384,"cell_head_chars":4096},"cells_cut":0,"cells_raw":0,"read":"whole","date_system":"1900"}

{"sheet":"入力シート","index":0,"n_rows":103,"n_cols":84,"rows_kept":103,"cut":false,"hidden":false,"merged":[[7,7,7,30],[7,41,8,69],[87,32,89,54],[80,15,80,22],[90,1,93,9],[90,10,90,14],[91,10,91,14],[92,10,92,14],[93,10,93,14],[93,15,93,17],[93,19,93,21],[93,23,93,25],[90,15,90,30],[91,15,91,30],[92,15,92,38],[85,1,85,9],[85,10,85,11],[85,12,85,13],[88,1,88,9],[88,10,88,22],[82,1,83,9],[82,10,82,14],[82,15,82,18],[83,10,83,14],[83,15,83,18],[5,7,5,12],[86,1,86,9],[86,10,86,11],[86,12,86,13],[26,10,26,12],[25,13,25,22],[26,13,26,22],[18,19,18,24],[20,15,20,18],[21,15,21,18],[20,10,21,14],[22,10,23,14],[22,19,22,41],[21,19,21,24],[59,18,59,20],[55,10,55,14],[55,15,55,16],[56,10,56,14],[56,15,56,28],[40,10,40,14],[42,10,42,14],[34,10,35,14],[34,15,34,18],[34,19,34,24],[31,10,31,14],[1,1,3,12],[5,1,5,6],[5,13,5,14],[5,16,5,17],[10,1,10,6],[10,7,10,12],[1,15,1,19],[2,15,2,19],[3,15,3,19],[7,1,7,6],[8,1,8,6],[8,7,8,9],[8,13,8,14],[8,16,8,17],[8,10,8,11],[12,1,13,9],[12,10,12,12],[13,10,13,12],[12,13,12,37],[13,13,13,37],[15,1,15,9],[15,10,15,13],[17,10,17,14],[18,10,19,14],[18,15,18,18],[19,15,19,18],[18,25,19,46],[17,1,23,9],[20,19,20,24],[17,15,17,16],[17,18,17,20],[19,19,19,24],[31,15,31,16],[31,18,31,20],[33,19,33,24],[102,7,102,33],[32,10,33,14],[32,19,32,24],[23,19,23,41],[22,15,22,18],[23,15,23,18],[28,10,28,13],[29,10,29,11],[29,12,29,13],[25,1,26,9],[25,10,25,12],[32,25,33,46],[35,15,35,18],[47,15,47,18],[49,15,49,18],[32,15,32,18],[33,15,33,18],[31,1,40,9],[40,15,40,17],[36,10,37,14],[28,1,28,9],[29,1,29,9],[38,10,39,14],[38,15,38,18],[42,1,52,9],[42,15,42,28],[50,10,50,14],[51,10,51,14],[50,15,50,28],[51,15,51,28],[48,10,49,14],[48,15,48,18],[48,19,48,41],[43,10,43,14],[45,19,45,24],[52,10,52,14],[52,15,52,17],[52,19,52,21],[52,23,52,25],[46,10,47,14],[46,15,46,18],[46,19,46,24],[44,25,45,46],[43,15,43,16],[43,18,43,20],[35,19,35,24],[47,19,47,24],[38,19,38,41],[39,15,39,18],[39,19,39,41],[45,15,45,18],[36,19,36,41],[37,15,37,18],[37,19,37,41],[40,19,40,21],[40,23,40,25],[36,15,36,18],[78,15,78,30],[75,10,75,14],[76,10,76,14],[74,10,74,20],[70,15,70,17],[71,15,71,17],[72,15,72,17],[77,31,78,43],[44,10,45,14],[44,15,44,18],[44,19,44,24],[49,19,49,41],[54,10,54,14],[54,15,54,41],[79,10,79,14],[79,15,79,30],[80,10,80,14],[74,21,74,23],[74,24,74,25],[74,27,74,28],[77,10,78,14],[75,15,75,18],[58,10,58,14],[58,15,58,28],[59,10,59,14],[60,10,61,14],[60,15,60,18],[60,19,60,24],[61,15,61,18],[61,19,61,24],[62,10,63,14],[62,15,62,18],[62,19,62,24],[63,15,63,18],[65,19,65,41],[75,19,75,20],[76,15,76,30],[77,15,77,30],[54,1,68,9],[70,10,70,14],[71,10,71,14],[72,10,72,14],[73,10,73,14],[67,10,67,14],[67,15,67,28],[68,10,68,14],[68,15,68,17],[68,19,68,21],[68,23,68,25],[64,10,65,14],[64,15,64,18],[64,19,64,41],[65,15,65,18],[66,10,66,14],[66,15,66,28],[57,10,57,14],[57,15,57,28],[59,15,59,16],[70,1,80,9],[73,15,73,17],[60,25,61,46],[63,19,63,24]]}
[null,null,null,null,null,null,null,null,null,null,null,null,null,null,null,null,null,null,null,null,null,null,null,null,null,null,null,null,null,null,null,null,null,null,null,null,null,null,null,null,null,null,null,null,null,null,null,null,null,null,null,null,null,null,null,null,null,null,null,null,null,null,null,0]
[null,"入力シート",null,null,null,null,null,null,null,null,null,null,null,null,null,null,null,null,null,null,"黄色のセルは必ず入力いただく項目です。"]
[null,null,null,null,null,null,null,null,null,null,null,null,null,null,null,null,null,null,null,null,"オレンジ色のセルは、当てはまる場合のみ入力いただく項目です。"]
[null,null,null,null,null,null,null,null,null,null,null,null,null,null,null,null,null,null,null,null,"セルが黒く反転した場合は、入力不要です。"]
[]
[null,"記入日",null,null,null,null,null,"2025年",null,null,null,null,null,null,null,"月",null,null,"日","←プルダウンから選択してください。"]
[]
[null,"商品の種類",null,null,null,null,null,null,null,null,null,null,null,null,null,null,null,null,null,null,null,null,null,null,null,null,null,null,null,null,null,"←プルダウンから選択してください。",null,null,null,null,null,null,null,null,null,{"$f":"IF($H$8=ﾌﾟﾙﾀﾞｳﾝﾘｽﾄ!$H$7,\"「1.管理計画認定マンション向け商品（10年満期時年平均利率：0.575％）」を選択された場合、　地方公共団体が発行した「認定通知書」の写しも提出いただく必要があります。\",\"\")","v":""}]
[null,{"$f":"IF($H$8=ﾌﾟﾙﾀﾞｳﾝﾘｽﾄ!$H$7,\"認定日\",\"入力不要\")","v":"入力不要"},null,null,null,null,null,"（西暦）",null,null,null,null,"年",null,null,"月",null,null,"日","←管理計画認定マンションの場合、認定日をプルダウンから入力願います。"]
[]
[null,"積立組合番号",null,null,null,null,null,null,null,null,null,null,null,"←既に積立てを行っている管理組合が応募する場合は必ず入力願います（「3」から始まる6桁の番号）。"]
[]
[null,"マンション管理組合の名称",null,null,null,null,null,null,null,null,"フリガナ",null,null,null,null,null,null,null,null,null,null,null,null,null,null,null,null,null,null,null,null,null,null,null,null,null,null,null,"←80文字以下で入力願います。"]
[null,null,null,null,null,null,null,null,null,null,"漢字等",null,null,null,null,null,null,null,null,null,null,null,null,null,null,null,null,null,null,null,null,null,null,null,null,null,null,null,"←40文字以下で入力願います。"]
[]
[null,"法人登記の有無",null,null,null,null,null,null,null,null,null,null,null,null,"←プルダウンから選択してください。"]
[]
[null,"マンションの所在地\n（住居表示上の住所）",null,null,null,null,null,null,null,null,"郵便番号",null,null,null,null,null,null,"－"]
[null,null,null,null,null,null,null,null,null,null,"都道府県",null,null,null,null,"フリガナ",null,null,null,{"$f":"IF(P18=\"\",\"\",VLOOKUP(TEXT(P18,\"000\"),郵便番号!$A$1:$C$948,3,0))","v":""},null,null,null,null,null,"←郵便番号（上３桁）から自動表示されます。\n   自動表示される都道府県名が異なる場合は、お手数ですが、直接入力願います。"]
[null,null,null,null,null,null,null,null,null,null,null,null,null,null,null,"漢字等",null,null,null,{"$f":"IF(P18=\"\",\"\",VLOOKUP(TEXT(P18,\"000\"),郵便番号!$A$1:$C$948,2,0))","v":""}]
{"$rows_left_out":84}
{"sheet":"出力シート","index":1,"n_rows":71,"n_cols":64,"rows_kept":71,"cut":false,"hidden":false,"merged":[[26,3,32,10],[15,14,15,39],[22,14,22,39],[31,16,31,39],[32,16,32,39],[24,11,25,28],[31,11,31,15],[18,20,18,39],[25,34,25,35],[25,36,25,37],[21,14,21,39],[26,20,26,39],[23,11,23,13],[1,2,1,4],[3,34,3,35],[3,37,3,38],[3,28,3,33],[14,17,14,39],[16,11,16,39],[14,3,14,10],[15,3,16,10],[17,3,17,10],[12,1,12,10],[12,11,12,39],[14,1,22,2],[13,3,13,10],[13,13,13,14],[13,15,13,16],[13,17,13,18],[13,19,13,20],[13,21,13,22],[13,23,13,24],[13,25,13,39],[13,11,13,12],[0,28,0,39],[30,11,30,15],[29,11,29,15],[23,29,24,33],[23,34,24,37],[23,38,24,39],[15,11,15,13],[29,16,29,39],[23,14,23,28],[30,16,30,39],[18,11,18,16],[19,11,20,12],[19,13,20,13],[19,14,20,16],[41,22,41,29],[53,11,53,14],[54,11,54,14],[50,20,50,39],[46,11,46,39],[44,5,44,39],[34,1,42,10],[35,11,35,39],[34,11,34,39],[39,15,39,39],[40,15,40,39],[39,11,39,14],[49,11,49,39],[45,3,45,10],[42,30,42,31],[42,33,42,35],[40,11,40,14],[37,11,38,12],[37,13,38,13],[37,14,38,16],[42,37,42,39],[46,3,46,10],[53,15,53,39],[45,11,45,39],[23,1,33,2],[33,3,33,10],[23,3,25,10],[56,22,56,29],[22,11,22,13],[18,3,22,10],[33,17,33,20],[33,22,33,25],[64,33,65,39],[65,1,68,10],[58,13,59,15],[57,18,57,21],[65,11,66,14],[57,13,57,14],[65,31,68,32],[65,19,68,26],[65,27,68,28],[65,29,68,30],[65,15,66,17],[67,15,68,17],[62,13,62,39],[63,13,63,39],[61,13,61,39],[57,5,57,6],[67,11,68,14],[58,3,59,12],[58,18,59,19],[59,27,59,39],[57,15,57,16],[60,13,60,19],[57,27,57,39],[58,16,59,17],[58,22,59,26],[57,10,57,11],[57,25,57,26],[60,27,60,39],[58,20,59,21],[56,37,56,39],[47,4,56,10],[57,1,63,2],[62,3,63,12],[42,22,42,29],[43,11,43,39],[57,8,57,9],[61,3,61,12],[58,27,58,39],[60,3,60,12],[60,20,60,22],[57,3,57,4],[54,15,54,39],[56,11,56,21],[55,11,55,21],[55,22,55,29],[56,30,56,31],[56,33,56,35],[55,30,55,39],[51,11,52,12],[51,13,52,13],[51,14,52,16],[50,11,50,16],[36,11,36,16],[27,11,28,12],[27,13,28,13],[27,14,28,16],[26,11,26,16],[70,1,71,39],[14,11,14,16],[19,17,20,39],[27,17,28,39],[37,17,38,39],[51,17,52,39],[60,23,60,26],[36,20,36,39],[25,29,25,33],[57,22,57,24],[32,11,32,15],[17,11,17,17],[47,11,47,39],[48,11,48,39],[33,11,33,15],[41,30,41,39],[41,11,41,21],[42,11,42,21],[43,1,43,10]]}
[null,null,null,null,null,null,null,null,null,null,null,null,null,null,null,null,null,null,null,null,null,null,null,null,null,null,null,null,null,null,null,null,null,null,null,null,null,null,null,null,null,null,null,null,null,null,null,null,null,null,null,null,null,null,null,null,null,null,null,null,null,null,null,1]
[null,null,"NA51",null,null,null,"2025年度マンションすまい・る債　積立申込書（兼 送付先指定依頼書）"]
[]
[null,null,null,"独立行政法人住宅金融支援機構　殿",null,null,null,null,null,null,null,null,null,null,null,null,null,null,null,null,null,null,null,null,null,null,null,null,"記入日：2025年",null,null,null,null,null,{"$f":"IF(入力シート!$N$6=\"\",\"\",入力シート!$N$6)","v":""},null,"月",{"$f":"IF(入力シート!$Q$6=\"\",\"\",入力シート!$Q$6)","v":""},null,"日"]
[]
[null,null,null,null,"独立行政法人住宅金融支援機構は、個人情報の保護に関する法律（平成15年法律第57号）に基づき、お客さまから提供を受けた個人情報をマンションすまい・る債の"]
[null,null,null,"　発行に付随する業務及び次の利用目的の達成に必要な範囲で利用いたします。"]
[null,null,null,"＜利用目的＞",null,null,"・お客さまの本人確認や積立申込条件等を満たしていることの確認のため",null,null,null,null,null,null,null,null,null,null,null,null,null,null,null,null,null,null,"・債券発行のため"]
[null,null,null,"　",null,null,"・期日管理等継続的な取引における管理のため",null,null,null,null,null,null,null,null,null,null,null,null,null,null,null,null,null,null,"・住宅関連の情報提供のため"]
[null,null,null,null,null,null,"・法律等に基づく権利の行使や義務の履行のため",null,null,null,null,null,null,null,null,null,null,null,null,null,null,null,null,null,null,"・市場調査や分析・統計の実施のため"]
[null,null,null,null,null,null,"・アンケートの実施等による機構に関連する商品やサービスの研究・開発のため",null,null,null,null,null,null,null,null,null,null,null,null,null,null,null,null,null,null,"・マンション共用部分リフォーム融資利用時の保証料適用のため"]
[]
[null,"商品の種類",null,null,null,null,null,null,null,null,null,{"$f":"IF(入力シート!$H$8=\"\",\"\",入力シート!$H$8)","v":""}]
[null,null,null,"認定日",null,null,null,null,null,null,null,"（西暦）",null,{"$f":"IF(入力シート!$B$9=\"入力不要\",\"---\",入力シート!$K$9)","v":"---"},null,"年",null,{"$f":"IF(入力シート!$B$9=\"入力不要\",\"---\",入力シート!$N$9)","v":"---"},null,"月",null,{"$f":"IF(入力シート!$B$9=\"入力不要\",\"---\",入力シート!$Q$9)","v":"---"},null,"日",null,"◀上記選択欄で「1.」を選択した場合のみ記入願います。"]
[null,"マンション管理組合\nの名称等",null,"積立組合番号",null,null,null,null,null,null,null,{"$f":"IF(入力シート!$H$11=\"\",\"\",入力シート!$H$11)","v":""},null,null,null,null,null,"◀既に積立てを行っている管理組合が応募する場合は必ず記入してください。"]
[null,null,null,"マンション管理組合の\n名称",null,null,null,null,null,null,null,"（ﾌﾘｶﾞﾅ）",null,null,{"$f":"IF(入力シート!$N$13=\"\",\"\",入力シート!$N$13)","v":""}]
[null,null,null,null,null,null,null,null,null,null,null,{"$f":"IF(入力シート!$N$14=\"\",\"\",入力シート!$N$14)","v":""}]
[null,null,null,"法人登記の有無",null,null,null,null,null,null,null,{"$f":"IF(入力シート!$K$16=\"\",\"\",入力シート!$K$16)","v":""},null,null,null,null,null,null,"住所コード（記入不要）"]
[null,null,null,"マンションの\n所在地",null,null,null,null,null,null,null,"郵便番号",null,null,null,null,null,"(ﾌﾘｶﾞﾅ)",null,null,{"$f":"入力シート!$T$19&入力シート!$T$21","v":""}]
[null,null,null,null,null,null,null,null,null,null,null,{"$f":"IF(入力シート!$P$18=\"\",\"\",入力シート!$P$18)","v":""},null,"－",{"$f":"IF(入力シート!$S$18=\"\",\"\",入力シート!$S$18)","v":""},null,null,{"$f":"入力シート!$T$20&入力シート!$T$22","v":""}]
{"$rows_left_out":52}
{"sheet":"入力方法等のご案内","index":2,"n_rows":49,"n_cols":5,"rows_kept":49,"cut":false,"hidden":false,"merged":[[48,3,52,11],[1,1,2,12],[29,3,39,11]]}
[]
[null,"本ツールの入力方法やご注意点に関するご案内"]
[]
[]
[null,"１　入力方法"]
[null,null,"①　「入力シート」の各項目に入力をお願いします。"]
[null,null,"　　プルダウンリストから選択いただく項目と直接入力いただく項目があります。"]
[null,null,"　　入力セルの色分けは次のとおりです。"]
[]
[null,null,null,null,"必ず入力いただく項目です。"]
[null,null,null,null,"当てはまる場合のみ入力いただく項目です。"]
[null,null,null,null,"入力不要です。"]
[]
[null,null,"②　全ての項目の入力が終わりましたら、「エラーチェック」ボタンを押してください。"]
[null,null,"　②－１　エラーがある場合"]
[null,null,"　　セルが赤く反転するとともに、エラーメッセージが表示されます。"]
[null,null,"　　内容をご確認いただき、追加入力や修正をお願いします。"]
[null,null,"　　追加入力等が終わりましたら、再度「エラーチェック」ボタンを押し、エラーの有無をご確認ください。"]
[null,null,"　②－２　エラーがない場合"]
[null,null,"　　「エラー項目はありません。（以下略）」というメッセージが表示されます。"]
{"$rows_left_out":30}
{"sheet":"送付先指定について","index":3,"n_rows":54,"n_cols":3,"rows_kept":54,"cut":false,"hidden":false,"merged":[[3,1,5,12],[32,1,48,12],[53,1,62,12]]}
[]
[]
[]
[null,"　住宅金融支援機構等から送付する書類は、あらかじめ届け出られた管理組合の代表者の方（理事長等）あてに送付しますが、「送付先指定」をしていただくことにより、送付先をご担当の管理会社に変更することができます。"]
[]
[]
[]
[]
[]
[]
[]
[]
[]
[]
[]
[]
[]
[]
[]
[]
{"$rows_left_out":35}
{"sheet":"宛先兼チェックリスト","index":4,"n_rows":52,"n_cols":31,"rows_kept":52,"cut":false,"hidden":false,"merged":[[40,0,40,15],[39,16,40,36],[35,4,37,32],[6,19,29,20],[7,16,33,17],[3,1,7,4],[0,0,0,7],[12,3,33,4],[21,1,33,2],[7,30,33,31],[39,0,39,15],[50,16,51,36],[51,0,51,15],[47,0,47,15],[48,0,49,15],[41,0,42,15],[43,0,44,15],[46,0,46,15],[45,0,45,15],[50,0,50,15],[42,16,43,36],[44,16,45,36],[46,16,47,36],[48,16,49,36],[41,16,41,36]]}
["（宛先兼チェックリスト）"]
[]
[]
[null,"郵便切手\nを貼付して\nください"]
[]
[]
[null,null,null,null,null,null,null,null,null,null,null,null,null,null,null,null,null,null,null,"住宅金融支援機構"]
[null,null,null,null,null,null,null,null,null,null,null,null,null,null,null,null,"住宅債券事務センター行",null,null,null,null,null,null,null,null,null,null,null,null,null,"東\n京\n都\n文\n京\n区\n後\n楽\n１\n丁\n目\n４\n番\n10\n号"]
[]
[]
[]
[]
[null,null,null,"マンションすまい・る債"]
[]
[]
[]
[]
[]
[]
[]
{"$rows_left_out":33}
{"sheet":"入力例","index":5,"n_rows":103,"n_cols":84,"rows_kept":103,"cut":false,"hidden":false,"merged":[[7,39,9,67],[8,1,8,6],[8,7,8,9],[8,10,8,11],[8,13,8,14],[8,16,8,17],[1,1,3,12],[1,15,1,19],[2,15,2,19],[3,15,3,19],[5,1,5,6],[5,7,5,12],[5,13,5,14],[5,16,5,17],[10,1,10,6],[10,7,10,12],[12,1,13,9],[12,10,12,12],[12,13,12,37],[13,10,13,12],[13,13,13,37],[7,1,7,6],[7,7,7,27],[18,25,19,46],[19,15,19,18],[19,19,19,24],[20,10,21,14],[20,15,20,18],[20,19,20,24],[21,15,21,18],[21,19,21,24],[15,1,15,9],[15,10,15,13],[17,1,23,9],[17,10,17,14],[17,15,17,16],[17,18,17,20],[18,10,19,14],[18,15,18,18],[18,19,18,24],[22,10,23,14],[22,15,22,18],[22,19,22,41],[23,15,23,18],[23,19,23,41],[25,1,26,9],[25,10,25,12],[25,13,25,22],[26,10,26,12],[26,13,26,22],[31,15,31,16],[31,18,31,20],[32,10,33,14],[32,15,32,18],[32,19,32,24],[32,25,33,46],[33,15,33,18],[33,19,33,24],[28,1,28,9],[28,10,28,13],[29,1,29,9],[29,10,29,11],[29,12,29,13],[31,1,40,9],[31,10,31,14],[34,10,35,14],[38,10,39,14],[38,15,38,18],[38,19,38,41],[39,15,39,18],[39,19,39,41],[40,10,40,14],[40,15,40,17],[40,19,40,21],[40,23,40,25],[34,15,34,18],[34,19,34,24],[35,15,35,18],[35,19,35,24],[36,10,37,14],[36,15,36,18],[36,19,36,41],[37,15,37,18],[37,19,37,41],[45,15,45,18],[45,19,45,24],[46,10,47,14],[46,15,46,18],[46,19,46,24],[47,15,47,18],[47,19,47,24],[42,1,52,9],[42,10,42,14],[42,15,42,28],[43,10,43,14],[43,15,43,16],[43,18,43,20],[44,10,45,14],[44,15,44,18],[44,19,44,24],[44,25,45,46],[51,10,51,14],[51,15,51,28],[52,10,52,14],[52,15,52,17],[52,19,52,21],[52,23,52,25],[48,10,49,14],[48,15,48,18],[48,19,48,41],[49,15,49,18],[49,19,49,41],[50,10,50,14],[50,15,50,28],[54,1,68,9],[54,10,54,14],[54,15,54,41],[55,10,55,14],[55,15,55,16],[56,10,56,14],[56,15,56,28],[57,10,57,14],[57,15,57,28],[58,10,58,14],[58,15,58,28],[59,10,59,14],[59,15,59,16],[59,18,59,20],[60,10,61,14],[60,15,60,18],[60,19,60,24],[60,25,61,46],[61,15,61,18],[61,19,61,24],[66,10,66,14],[66,15,66,28],[67,10,67,14],[67,15,67,28],[68,10,68,14],[68,15,68,17],[68,19,68,21],[68,23,68,25],[62,10,63,14],[62,15,62,18],[62,19,62,24],[63,15,63,18],[63,19,63,24],[64,10,65,14],[64,15,64,18],[64,19,64,41],[65,15,65,18],[65,19,65,41],[76,10,76,14],[76,15,76,30],[77,10,78,14],[77,15,77,30],[77,31,78,43],[78,15,78,30],[74,21,74,23],[74,24,74,25],[74,27,74,28],[75,10,75,14],[75,15,75,18],[75,19,75,20],[74,10,74,20],[85,1,85,9],[85,10,85,11],[85,12,85,13],[86,1,86,9],[86,10,86,11],[86,12,86,13],[79,10,79,14],[79,15,79,30],[80,10,80,14],[80,15,80,22],[82,1,83,9],[82,10,82,14],[82,15,82,18],[83,10,83,14],[83,15,83,18],[70,1,80,9],[70,10,70,14],[70,15,70,17],[71,10,71,14],[71,15,71,17],[72,10,72,14],[72,15,72,17],[73,10,73,14],[73,15,73,17],[93,10,93,14],[93,15,93,17],[93,19,93,21],[93,23,93,25],[102,7,102,33],[87,32,89,54],[88,1,88,9],[88,10,88,22],[90,1,93,9],[90,10,90,14],[90,15,90,30],[91,10,91,14],[91,15,91,30],[92,10,92,14],[92,15,92,38]]}
[null,null,null,null,null,null,null,null,null,null,null,null,null,null,null,null,null,null,null,null,null,null,null,null,null,null,null,null,null,null,null,null,null,null,null,null,null,null,null,null,null,null,null,null,null,null,null,null,null,null,null,null,null,null,null,null,null,null,null,null,null,null,null,0]
[null,"入力シート",null,null,null,null,null,null,null,null,null,null,null,null,null,null,null,null,null,null,"黄色のセルは必ず入力いただく項目です。"]
[null,null,null,null,null,null,null,null,null,null,null,null,null,null,null,null,null,null,null,null,"オレンジ色のセルは、当てはまる場合のみ入力いただく項目です。"]
[null,null,null,null,null,null,null,null,null,null,null,null,null,null,null,null,null,null,null,null,"セルが黒く反転した場合は、入力不要です。"]
[]
[null,"記入日",null,null,null,null,null,"2025年",null,null,null,null,null,5,null,"月",31,null,"日","←プルダウンから選択してください。"]
[]
[null,"商品の種類",null,null,null,null,null,"0.通常商品（10年満期時年平均利率（税引前）：0.525％）",null,null,null,null,null,null,null,null,null,null,null,null,null,null,null,null,null,null,null,null,"←プルダウンから選択してください。",null,null,null,null,null,null,null,null,null,null,{"$f":"IF($H$8=\"1.管理計画認定マンション向け商品（10年満期時年平均利率：0.408％）\",\"「1.管理計画認定マンション向け商品（10年満期時年平均利率：0.408％）」を選択された場合、　地方公共団体が発行した「認定通知書」の写しも提出いただく必要があります。\",\"\")","v":""}]
[null,{"$f":"IF($H$8=\"1.管理計画認定マンション向け商品（10年満期時年平均利率（税引前）：0.550％）\",\"認定日\",\"入力不要\")","v":"入力不要"},null,null,null,null,null,"（西暦）",null,null,2023,null,"年",4,null,"月",30,null,"日","←管理計画認定マンションの場合、認定日をプルダウンから入力願います。"]
[]
[null,"積立組合番号",null,null,null,null,null,333333,null,null,null,null,null,"←既に積立てを行っている管理組合が応募する場合は必ず入力願います（「3」から始まる6桁の番号）。"]
[]
[null,"マンション管理組合の名称",null,null,null,null,null,null,null,null,"フリガナ",null,null,"ｷｺｳﾏﾝｼｮﾝｶﾝﾘｸﾐｱｲ",null,null,null,null,null,null,null,null,null,null,null,null,null,null,null,null,null,null,null,null,null,null,null,null,"←80文字以下で入力願います。"]
[null,null,null,null,null,null,null,null,null,null,"漢字等",null,null,"機構マンション管理組合",null,null,null,null,null,null,null,null,null,null,null,null,null,null,null,null,null,null,null,null,null,null,null,null,"←40文字以下で入力願います。"]
[]
[null,"法人登記の有無",null,null,null,null,null,null,null,null,"1.あり",null,null,null,"←プルダウンから選択してください。"]
[]
[null,"マンションの所在地\n（住居表示上の住所）",null,null,null,null,null,null,null,null,"郵便番号",null,null,null,null,112,null,"－",8570]
[null,null,null,null,null,null,null,null,null,null,"都道府県",null,null,null,null,"フリガナ",null,null,null,{"$f":"IF(P18=\"\",\"\",VLOOKUP(TEXT(P18,\"000\"),郵便番号!$A$1:$C$948,3,0))","v":"ﾄｳｷｮｳﾄ"},null,null,null,null,null,"←郵便番号（上３桁）から自動表示されます。\n   自動表示される都道府県名が異なる場合は、お手数ですが、直接入力願います。"]
[null,null,null,null,null,null,null,null,null,null,null,null,null,null,null,"漢字等",null,null,null,{"$f":"IF(P18=\"\",\"\",VLOOKUP(TEXT(P18,\"000\"),郵便番号!$A$1:$C$948,2,0))","v":"東京都"}]
{"$rows_left_out":84}
{"sheet":"【参考】将来の受取利息額","index":6,"n_rows":28,"n_cols":19,"rows_kept":28,"cut":false,"hidden":false,"merged":[[13,18,13,23],[14,1,14,5],[14,14,14,17],[14,18,14,23],[13,14,13,17],[14,6,14,9],[13,1,13,5],[13,6,13,9],[13,10,13,13],[14,10,14,13],[1,1,1,23],[10,2,10,7],[11,2,11,7],[10,8,10,11],[11,8,11,11],[10,12,10,13],[11,12,11,13],[8,2,8,7],[8,8,8,23],[10,14,11,23],[19,14,19,17],[22,18,22,23],[19,10,19,13],[20,10,20,13],[20,1,20,5],[22,6,22,9],[20,14,20,17],[19,18,19,23],[20,18,20,23],[21,18,21,23],[19,6,19,9],[20,6,20,9],[19,1,19,5],[17,1,17,5],[18,1,18,5],[16,10,16,13],[15,1,15,5],[16,1,16,5],[15,6,15,9],[16,6,16,9],[17,6,17,9],[18,6,18,9],[15,18,15,23],[16,18,16,23],[17,18,17,23],[18,18,18,23],[17,10,17,13],[18,10,18,13],[15,14,15,17],[16,14,16,17],[17,14,17,17],[18,14,18,17],[15,10,15,13],[23,18,23,23],[24,18,24,23],[24,1,24,9],[21,14,21,17],[22,14,22,17],[23,14,23,17],[24,14,24,17],[23,10,23,13],[24,10,24,13],[21,1,21,5],[22,1,22,5],[23,1,23,5],[21,10,21,13],[22,10,22,13],[23,6,23,9],[21,6,21,9]]}
[]
[null,"将来の受取利息額（概算）について 【2025年度発行債券】"]
[]
[null,null,"　満期まで毎年１回定期的にご指定いただいた口座に、マンションすまい・る債の利息をお振り込みします。"]
[null,null,"　今年度発行債券の満期までの単年利率と応募いただいた口数の受取利息額（概算）は下表のとおりです。"]
[null,null,"　なお、債券の利息は源泉分離課税の適用となり、所得税及び復興特別所得税の合計15.315％（2025年1月末"]
[null,null,"現在の税率）相当額を差し引いてお支払いします（満期日後の利息は付きません。）。"]
[]
[null,null,"商 品 の 種 類",null,null,null,null,null,{"$f":"入力シート!$H$8","v":0}]
[]
[null,null,"応　募　口　数",null,null,null,null,null,{"$f":"入力シート!$P$83","v":0},null,null,null,"口",null," ※応募口数は「入力シート」下方の「１回あたりの積立希望\n 　 口数」の「口数」欄に入力してください。"]
[null,null,"応　募　金　額",null,null,null,null,null,{"$f":"入力シート!$P$84","v":""},null,null,null,"万円"]
[]
[null,"経過年数\n（受取時期）",null,null,null,null,"単年利率",null,null,null,"毎年の\n受取利息額※１\n（税引前）\nＡ",null,null,null,"所得税及び\n復興特別所得税\n（15.315％※２）\nＢ",null,null,null,"毎年の\n受取利息額\n（税引後）\nＡ－Ｂ"]
[null,"1年目\n（2027年2月）",null,null,null,null,{"$f":"IF($I$9=ﾌﾟﾙﾀﾞｳﾝﾘｽﾄ!$H$6,単年利率入力!$C3,IF($I$9=ﾌﾟﾙﾀﾞｳﾝﾘｽﾄ!$H$7,単年利率入力!$D3,\"0%\"))","v":"0%"},null,null,null,{"$f":"ROUNDDOWN(500000*G15,0)*$I$11","v":0},null,null,null,{"$f":"ROUNDDOWN(500000*G15*0.15315,0)*$I$11","v":0},null,null,null,{"$f":"K15-O15","v":0}]
[null,"2年目\n（2028年2月）",null,null,null,null,{"$f":"IF($I$9=ﾌﾟﾙﾀﾞｳﾝﾘｽﾄ!$H$6,単年利率入力!$C4,IF($I$9=ﾌﾟﾙﾀﾞｳﾝﾘｽﾄ!$H$7,単年利率入力!$D4,\"0%\"))","v":"0%"},null,null,null,{"$f":"ROUNDDOWN(500000*G16,0)*$I$11","v":0},null,null,null,{"$f":"ROUNDDOWN(500000*G16*0.15315,0)*$I$11","v":0},null,null,null,{"$f":"K16-O16","v":0}]
[null,"3年目\n（2029年2月）",null,null,null,null,{"$f":"IF($I$9=ﾌﾟﾙﾀﾞｳﾝﾘｽﾄ!$H$6,単年利率入力!$C5,IF($I$9=ﾌﾟﾙﾀﾞｳﾝﾘｽﾄ!$H$7,単年利率入力!$D5,\"0%\"))","v":"0%"},null,null,null,0,null,null,null,0,null,null,null,0]
[null,"4年目\n（2030年2月）",null,null,null,null,{"$f":"IF($I$9=ﾌﾟﾙﾀﾞｳﾝﾘｽﾄ!$H$6,単年利率入力!$C6,IF($I$9=ﾌﾟﾙﾀﾞｳﾝﾘｽﾄ!$H$7,単年利率入力!$D6,\"0%\"))","v":"0%"},null,null,null,0,null,null,null,0,null,null,null,0]
[null,"5年目\n（2031年2月）",null,null,null,null,{"$f":"IF($I$9=ﾌﾟﾙﾀﾞｳﾝﾘｽﾄ!$H$6,単年利率入力!$C7,IF($I$9=ﾌﾟﾙﾀﾞｳﾝﾘｽﾄ!$H$7,単年利率入力!$D7,\"0%\"))","v":"0%"},null,null,null,0,null,null,null,0,null,null,null,0]
[null,"6年目\n（2032年2月）",null,null,null,null,{"$f":"IF($I$9=ﾌﾟﾙﾀﾞｳﾝﾘｽﾄ!$H$6,単年利率入力!$C8,IF($I$9=ﾌﾟﾙﾀﾞｳﾝﾘｽﾄ!$H$7,単年利率入力!$D8,\"0%\"))","v":"0%"},null,null,null,0,null,null,null,0,null,null,null,0]
{"$rows_left_out":9}
{"sheet":"単年利率入力","index":7,"n_rows":12,"n_cols":4,"rows_kept":12,"cut":false,"hidden":true,"merged":[]}
[]
[null,null,"通常","認定"]
[null,"1年目",1E-4,{"$f":"C3+0.0005","v":6.0000000000000006E-4}]
[null,"2年目",6.4000000000000005E-4,{"$f":"C4+0.0005","v":1.14E-3}]
[null,"3年目",1.1800000000000001E-3,1.6800000000000001E-3]
[null,"4年目",1.72E-3,2.2199999999999998E-3]
[null,"5年目",2.31E-3,2.81E-3]
[null,"6年目",4.1900000000000001E-3,4.6899999999999997E-3]
[null,"7年目",7.92E-3,8.4200000000000004E-3]
[null,"8年目",9.7000000000000003E-3,1.0200000000000001E-2]
[null,"9年目",1.1480000000000001E-2,1.1980000000000001E-2]
[null,"10年目",1.3259999999999999E-2,1.376E-2]

{"sheet":"ﾌﾟﾙﾀﾞｳﾝﾘｽﾄ","index":8,"n_rows":61,"n_cols":64,"rows_kept":61,"cut":false,"hidden":true,"merged":[]}
[null,null,null,null,null,null,null,null,null,null,null,null,"↓2022年度の文言",null,null,null,null,null,null,null,null,null,null,null,null,null,null,null,null,null,null,null,null,null,null,null,null,null,null,null,null,null,null,null,null,null,null,null,null,null,null,null,null,null,null,null,null,null,null,null,null,null,null,1]
[null,"0.なし",1,"昭和","ｱ．機構発行の債券で安心・安全だから","1.送付先指定する",null,"1.送付先を管理会社に指定する（既にご利用中の組合が、送付先を変更する場合もこちら）","←セル位置を変えないように",null,null,null,"1.送付先指定する（既にご利用中の組合が、送付先を変更する場合もこちら）"]
[null,"1.あり",2,"平成","ｲ．利回りが良いから","2.送付先指定しない（すでに送付先指定している）",null,"2.送付先を管理会社に指定しない（＝送付先は管理組合代表者宛とする）","←セル位置を変えないように",null,null,null,"2.送付先指定しない（既にご利用中の組合が、送付先指定を中止する場合もこちら）"]
[null,null,3,"令和","ｳ．マンション管理に役立つ特典があるから",null,null,"3.既に送付先を管理会社に指定していて、そのまま利用する","←セル位置を変えないように",null,null,null,"3.既に送付先を指定していて、そのまま利用する"]
[null,"都",4,null,"ｴ．共用部分リフォーム融資の金利引下げがあるから"]
[null,"道",5,null,null,null,null,"0.通常商品（10年満期時年平均利率（税引前）：0.525％）","←セル位置を変えないように",null,null,null,"↓事務Ｃからの提案"]
[null,"府",6,null,"ｱ．機構説明会","別添資料を確認し、末尾記載の事項を承認します。",null,"1.管理計画認定マンション向け商品（10年満期時年平均利率（税引前）：0.575％）","←セル位置を変えないように",null,null,null,"1.送付先指定する（既にご利用いただいている組合は、既存分も変更されます）"]
[null,"県",7,null,"ｲ．機構ホームページ（インターネット広告含む）",null,null,null,null,null,null,null,"2.送付先指定しない（代表者様に送付されます）"]
[null,null,8,null,"ｳ．新聞（一般紙）","1.上記記載の管理会社の連絡先と同じ",null,null,null,null,null,null,"3.既に送付先を指定していて、そのまま利用する"]
[null,"区",9,null,"ｴ．新聞（専門紙）","2.上記記載の管理会社の連絡先ではなく、次欄記載の宛先とする"]
[null,"市",10,null,"ｵ．マンション管理センター通信"]
[null,"郡",11,null,"ｶ．マンション管理会社からの紹介","1.すべての書類"]
[null,null,12,null,"ｷ．口コミ","2.残高証明書及び買入計算書のみ"]
[null,null,13,null,"ｸ．過去に積み立てた実績がある"]
[null,null,14,null,"ｹ．その他"]
[null,null,15]
[null,null,16]
[null,"未定",17,null,"ｱ．20年以上30年未満"]
[null,7,18,null,"ｲ．30年以上"]
[null,8,19]
{"$rows_left_out":42}
{"sheet":"郵便番号","index":9,"n_rows":948,"n_cols":3,"rows_kept":948,"cut":false,"hidden":true,"merged":[]}
["060","北海道","ﾎｯｶｲﾄﾞｳ"]
["064","北海道","ﾎｯｶｲﾄﾞｳ"]
["001","北海道","ﾎｯｶｲﾄﾞｳ"]
["002","北海道","ﾎｯｶｲﾄﾞｳ"]
["065","北海道","ﾎｯｶｲﾄﾞｳ"]
["007","北海道","ﾎｯｶｲﾄﾞｳ"]
["003","北海道","ﾎｯｶｲﾄﾞｳ"]
["062","北海道","ﾎｯｶｲﾄﾞｳ"]
["005","北海道","ﾎｯｶｲﾄﾞｳ"]
["061","北海道","ﾎｯｶｲﾄﾞｳ"]
["063","北海道","ﾎｯｶｲﾄﾞｳ"]
["004","北海道","ﾎｯｶｲﾄﾞｳ"]
["006","北海道","ﾎｯｶｲﾄﾞｳ"]
["040","北海道","ﾎｯｶｲﾄﾞｳ"]
["041","北海道","ﾎｯｶｲﾄﾞｳ"]
["042","北海道","ﾎｯｶｲﾄﾞｳ"]
["047","北海道","ﾎｯｶｲﾄﾞｳ"]
["048","北海道","ﾎｯｶｲﾄﾞｳ"]
["070","北海道","ﾎｯｶｲﾄﾞｳ"]
["079","北海道","ﾎｯｶｲﾄﾞｳ"]
{"$rows_left_out":928}