{"text_format":"1","workbook":"xlsx","n_sheets":6,"sheets":["入力シート","出力シート","入力方法等のご案内","必要書類","プルダウンリスト","郵便番号"],"not_rendered":{"charts":0,"images":0,"macros":1,"external_links":0,"defined_names":4,"comments":0,"pivot_tables":0},"unopened":[],"bounds":{"document_bytes":16777216,"sheet_cells":100000,"rows_first":2000,"rows_last":500,"rows_between":2000,"halvings":0,"cell_chars":16384,"cell_head_chars":4096},"cells_cut":0,"cells_raw":0,"read":"whole","date_system":"1900"}

{"sheet":"入力シート","index":0,"n_rows":60,"n_cols":64,"rows_kept":60,"cut":false,"hidden":false,"merged":[[44,7,45,11],[44,12,44,14],[45,12,45,14],[40,7,41,11],[40,12,40,15],[28,7,28,11],[28,12,28,14],[28,16,28,18],[34,12,34,17],[33,12,33,17],[35,12,35,34],[49,12,49,17],[36,26,37,53],[21,42,25,52],[25,12,25,17],[26,12,26,34],[27,35,28,54],[44,15,44,34],[45,15,45,34],[37,12,37,19],[43,12,43,17],[40,16,40,25],[52,4,52,5],[41,12,41,15],[41,16,41,25],[23,1,28,6],[59,2,59,28],[38,7,38,11],[38,12,38,14],[38,16,38,18],[38,20,38,22],[33,7,33,11],[34,7,34,11],[35,7,35,11],[31,20,31,22],[24,18,24,41],[25,7,25,11],[27,7,27,11],[52,1,52,3],[33,36,33,53],[49,7,49,11],[28,20,28,22],[32,28,32,34],[26,7,26,11],[32,12,32,27],[27,12,27,34],[47,1,50,6],[31,7,31,11],[31,12,31,14],[31,16,31,18],[32,7,32,11],[50,7,50,11],[50,12,50,34],[47,7,47,11],[47,12,47,13],[47,15,47,17],[48,7,48,11],[48,12,48,17],[42,7,42,11],[42,12,42,15],[36,7,36,11],[36,12,36,25],[37,7,37,11],[48,18,48,41],[30,1,31,6],[30,12,30,19],[32,1,38,6],[40,1,45,6],[30,7,30,11],[43,7,43,11],[23,12,23,13],[23,15,23,17],[9,25,10,52],[6,23,8,52],[1,12,1,16],[2,12,2,16],[3,15,3,19],[10,1,10,6],[10,7,10,8],[10,10,10,11],[10,13,10,14],[6,9,6,10],[7,9,7,10],[8,9,8,10],[1,1,2,9],[6,1,6,8],[7,1,7,8],[8,1,8,8],[6,12,6,19],[7,12,7,19],[8,12,8,19],[6,20,6,21],[24,7,24,11],[24,12,24,17],[14,1,14,6],[16,1,17,6],[18,1,19,6],[21,1,22,6],[23,7,23,11],[7,20,7,21],[8,20,8,21],[16,7,16,9],[17,7,17,9],[18,7,18,9],[21,7,21,9],[22,7,22,9],[16,10,16,34],[17,10,17,34],[21,10,21,19],[22,10,22,19],[19,10,19,34],[12,1,12,6],[12,7,12,12],[14,7,14,10],[18,10,18,34],[19,7,19,9]]}
[null,null,null,null,null,null,null,null,null,null,null,null,null,null,null,null,null,null,null,null,null,null,null,null,null,null,null,null,null,null,null,null,null,null,null,null,null,null,null,null,null,null,null,null,null,null,null,null,null,null,null,null,null,null,null,null,null,null,null,null,null,null,null,1]
[null,"入力シート",null,null,null,null,null,null,null,null,null,null,null,null,null,null,null,"黄色のセルは必ず入力いただく項目です。",null,null,null,null,null,null,null,null,null,null,null,null,null,null,null,null,null,null,null,null,null,null,null,null,null,null,null,null,null,null,null,null,null,null,null,null,null,null,null,null,null,null,null,null,null,true]
[null,null,null,null,null,null,null,null,null,null,null,null,null,null,null,null,null,"セルが黒く反転している場合は、入力不要です。",null,null,null,null,null,null,null,null,null,null,null,null,null,null,null,null,null,null,null,null,null,null,null,null,null,null,null,null,null,null,null,null,null,null,null,null,null,null,null,null,null,null,null,null,null,0]
[]
[null,"① 今回変更する項目に✔マークをつけてください。（□をクリックすると✔がつきます。）"]
[]
[null,"代表者氏名・住所",null,null,null,null,null,null,null,false,null,null,"届出印",null,null,null,null,null,null,null,false,null,null,{"$f":"IF(OR(J9=TRUE,U7=TRUE),\"変更届出書に組合印（届出印）の押印が必要です。\",\"\")","v":""}]
[null,"管理会社等の連絡先",null,null,null,null,null,null,null,false,null,null,"積立組合名称",null,null,null,null,null,null,null,false]
[null,"元利金振込先口座",null,null,null,null,null,null,null,false,null,null,"積立組合所在地",null,null,null,null,null,null,null,false]
[null,"② 黄色のセルに入力してください。",null,null,null,null,null,null,null,null,null,null,null,null,null,null,null,null,null,null,null,null,null,null,null,{"$f":"IF($J$7=TRUE,\"口座名義に代表者名が含まれている場合は、「元利金振込口座」も変更ください。\",\"\")","v":""}]
[null,"記入日",null,null,null,null,null,null,null,"年",null,null,"月",null,null,"日","←プルダウンから選択してください。"]
[]
[null,"積立組合番号",null,null,null,null,null,null,null,null,null,null,null,"←「3」から始まる6桁の番号を入力願います。"]
[]
[null,"法人登記の有無",null,null,null,null,null,null,null,null,null,"←プルダウンから選択してください。"]
[]
[null,"積立組合の名称\n（登録済の情報）",null,null,null,null,null,"フリガナ",null,null,null,null,null,null,null,null,null,null,null,null,null,null,null,null,null,null,null,null,null,null,null,null,null,null,null,"←80文字以下で入力願います。"]
[null,null,null,null,null,null,null,"漢字等",null,null,null,null,null,null,null,null,null,null,null,null,null,null,null,null,null,null,null,null,null,null,null,null,null,null,null,"←40文字以下で入力願います。"]
[null,{"$f":"IF(U8=TRUE,\"積立組合の名称      （変更後）\",\"入力不要\")","v":"入力不要"},null,null,null,null,null,"フリガナ",null,null,null,null,null,null,null,null,null,null,null,null,null,null,null,null,null,null,null,null,null,null,null,null,null,null,null,"←80文字以下で入力願います。"]
[null,null,null,null,null,null,null,"漢字等",null,null,null,null,null,null,null,null,null,null,null,null,null,null,null,null,null,null,null,null,null,null,null,null,null,null,null,"←40文字以下で入力願います。"]
[]
[null,{"$f":"IF(J7=TRUE,\"代表者氏名　　　　　　（変更後の情報）\",\"代表者氏名　　　　　　　（登録済の情報）\")","v":"代表者氏名　　　　　　　（登録済の情報）"},null,null,null,null,null,"フリガナ",null,null,null,null,null,null,null,null,null,null,null,null," ←「姓名」の間にスペース（半角）を入力のうえ、20文字以下で入力願います。",null,null,null,null,null,null,null,null,null,null,null,null,null,null,null,null,null,null,null,null,null,{"$f":"IF($J$7=TRUE,\"今回変更する新しい代表者の方の情報を入力してください。\",\"現在、登録されている代表者の方の情報を入力してください。\")","v":"現在、登録されている代表者の方の情報を入力してください。"}]
[null,null,null,null,null,null,null,"漢字等",null,null,null,null,null,null,null,null,null,null,null,null," ←「姓名」の間にスペース（全角）を入力のうえ、15文字以下で入力願います。"]
[null,{"$f":"IF(J7=TRUE,\"代表者住所等　　　　　　　（変更後の情報）\",\"代表者住所等　　　　　　　（登録済の情報）\")","v":"代表者住所等　　　　　　　（登録済の情報）"},null,null,null,null,null,"郵便番号",null,null,null,null,"",null,"－",""]
[null,null,null,null,null,null,null,"都道府県",null,null,null,null,{"$f":"IF($M$24=\"\",\"\",VLOOKUP(TEXT($M$24,\"000\"),郵便番号!$A$1:$C$948,2,0))","v":""},null,null,null,null,null,"←郵便番号（上３桁）から自動表示されます。\n   自動表示される都道府県名が異なる場合は、お手数ですが、直接入力願います。"]
[null,null,null,null,null,null,null,"市・区・郡"]
[null,null,null,null,null,null,null,"区町村名・番地",null,null,null,null,null,null,null,null,null,null,null,null,null,null,null,null,null,null,null,null,null,null,null,null,null,null,null,"←23文字以下で入力願います。"]
[null,null,null,null,null,null,null,"号室等",null,null,null,null,null,null,null,null,null,null,null,null,null,null,null,null,null,null,null,null,null,null,null,null,null,null,null,"←23文字以下で入力願います。\n　 なお、戸建てにお住まいの場合は、（戸建て）と入力願います。",null,null,null,null,null,null,null,null,null,null,null,null,null,null,null,null,null,null,null,{"$f":"IF(M28=\"（戸建て）\",1,0)","v":0}]
[null,null,null,null,null,null,null,"電話番号",null,null,null,null,"",null,null,"－","",null,null,"－",""]
[]
[null,{"$f":"IF(J8=TRUE,\"会計役員等氏名\",\"入力不要\")","v":"入力不要"},null,null,null,null,null,"漢字等",null,null,null,null,null,null,null,null,null,null,null,null," ←「姓名」の間にスペース（全角）を入力のうえ、15文字以下で入力願います。"]
[null,null,null,null,null,null,null,"電話番号",null,null,null,null,"",null,null,"－","",null,null,"－",""]
[null,{"$f":"IF(J8=TRUE,\"管理会社等の連絡先\",\"入力不要\")","v":"入力不要"},null,null,null,null,null,"管理会社名",null,null,null,null,null,null,null,null,null,null,null,null,null,null,null,null,null,null,null,null,"※自主管理組合の場合は、管理組合事務所等",null,null,null,null,null,null,false,"←自主管理組合の場合、✔を入れてください。"]
[null,null,null,null,null,null,null,"都道府県",null,null,null,null,null,null,null,null,null,null,null,null,null,null,null,null,null,null,null,null,null,null,null,null,null,null,null,null,"（□をクリックすると、✔がつきます。）"]
[null,null,null,null,null,null,null,"市・区・郡"]
[null,null,null,null,null,null,null,"区町村名・番地",null,null,null,null,null,null,null,null,null,null,null,null,null,null,null,null,null,null,null,null,null,null,null,null,null,null,null,"←23文字以下で入力願います。"]
[null,null,null,null,null,null,null,"担当部署名",null,null,null,null,null,null,null,null,null,null,null,null,null,null,null,null,null,null,"←「担当部署名」と「担当者名」を、合計23文字以下で入力願います。また、担当者名の「姓名」の\n　　間にスペース（空白）を入力願います。ただし、自主管理組合の場合は、入力不要です。",null,null,null,null,null,null,null,null,null,null,null,null,null,null,null,null,null,null,null,null,null,null,null,null,null,null,null,null,null,{"$f":"SUM(LEN(M37),LEN(M38))","v":0},null,null,null,0]
[null,null,null,null,null,null,null,"担当者名",null,null,null,null,null,null,null,null,null,null,null,null,null,null,null,null,null,null,null,null,null,null,null,null,null,null,null,null,null,null,null,null,null,null,null,null,null,null,null,null,null,null,null,null,null,null,null,null,null,null,null,null,0]
[null,null,null,null,null,null,null,"電話番号",null,null,null,null,"",null,null,"－","",null,null,"－","",null,null,"※自主管理組合の場合、入力は任意です。",null,null,null,null,null,null,null,null,null,null,null,null,null,null,null,null,null,null,null,null,null,null,null,null,null,null,null,null,null,null,null,null,null,null,null,null,0]
[]
[null,{"$f":"IF(J9=TRUE,\"元利金自動振込先口座\",\"入力不要\")","v":"入力不要"},null,null,null,null,null,"振込先",null,null,null,null,"金融機関"]
[null,null,null,null,null,null,null,null,null,null,null,null,"店舗名"]
[null,null,null,null,null,null,null,"預金種目",null,null,null,null,null,null,null,null,"←プルダウンから選択してください。"]
[null,null,null,null,null,null,null,"口座番号",null,null,null,null,"",null,null,null,null,null," ←７桁で入力願います。"]
[null,null,null,null,null,null,null,"預金口座名義",null,null,null,null,"フリガナ"]
[null,null,null,null,null,null,null,null,null,null,null,null,"漢字等"]
[]
[null,{"$f":"IF(U9=TRUE,\"積立組合所在地\",\"入力不要\")","v":"入力不要"},null,null,null,null,null,"郵便番号",null,null,null,null,"",null,"－",""]
[null,null,null,null,null,null,null,"都道府県",null,null,null,null,{"$f":"IF($M$48=\"\",\"\",VLOOKUP(TEXT($M$48,\"000\"),郵便番号!$A$1:$C$948,2,0))","v":""},null,null,null,null,null,"←郵便番号（上３桁）から自動表示されます。\n   自動表示される都道府県名が異なる場合は、お手数ですが、直接入力願います。"]
[null,null,null,null,null,null,null,"市・区・郡"]
[null,null,null,null,null,null,null,"区町村名・番地",null,null,null,null,null,null,null,null,null,null,null,null,null,null,null,null,null,null,null,null,null,null,null,null,null,null,null,"←23文字以下で入力願います。"]
[]
[]
[]
[]
[]
[]
[]
[]
[null,null,"エラーチェック後、入力もれ等がある場合は、セルが赤く反転します。ご確認をお願いします。"]
{"$rows_left_out":1}
{"sheet":"出力シート","index":1,"n_rows":55,"n_cols":79,"rows_kept":55,"cut":false,"hidden":false,"merged":[[56,1,56,3],[56,4,56,5],[37,1,38,5],[52,22,52,23],[52,24,52,25],[52,26,52,27],[52,28,52,29],[53,1,54,1],[53,5,54,5],[53,10,54,10],[37,8,40,8],[37,9,37,14],[52,1,52,2],[54,22,54,24],[54,25,54,26],[52,9,52,13],[52,14,52,15],[52,16,52,17],[52,18,52,19],[39,17,39,33],[40,17,40,33],[31,8,35,8],[42,31,46,38],[18,16,18,19],[18,20,18,38],[52,20,52,21],[47,1,49,38],[51,1,51,3],[51,4,51,6],[51,7,51,38],[37,30,38,33],[37,34,37,38],[38,9,38,11],[38,12,38,18],[38,19,38,22],[39,9,40,11],[37,15,37,22],[37,23,37,29],[32,10,32,30],[34,12,34,31],[35,12,35,20],[35,23,35,24],[39,1,40,5],[38,23,38,29],[39,12,39,16],[5,26,9,38],[6,1,6,18],[8,1,8,6],[9,13,9,18],[9,19,9,24],[9,1,9,6],[9,7,9,12],[8,7,8,8],[8,16,8,17],[8,9,8,11],[8,13,8,14],[31,1,32,6],[21,32,21,37],[23,10,23,12],[35,29,35,30],[1,1,1,38],[11,1,12,5],[13,9,13,14],[16,1,17,5],[16,8,21,8],[16,9,21,9],[16,10,17,10],[18,10,21,10],[19,15,19,38],[20,15,20,38],[21,15,21,19],[21,23,21,28],[19,11,19,14],[20,11,20,13],[11,9,11,14],[11,15,11,38],[12,15,12,38],[3,1,3,38],[5,1,5,14],[5,25,9,25],[13,1,14,5],[18,1,21,5],[13,15,13,38],[14,15,14,38],[16,15,16,38],[17,15,17,38],[18,12,18,14],[33,1,35,5],[23,14,23,17],[23,18,23,38],[24,9,25,12],[24,13,25,38],[27,1,27,5],[27,8,29,8],[27,24,27,38],[23,8,25,8],[24,1,25,5],[28,1,29,5],[27,9,29,15],[27,16,29,22],[35,26,35,27],[33,11,33,17],[33,18,33,31],[31,32,35,38]]}
[null,null,null,null,null,null,null,null,null,null,null,null,null,null,null,null,null,null,null,null,null,null,null,null,null,null,null,null,null,null,null,null,null,null,null,null,null,null,null,null,null,null,null,null,null,null,null,null,null,null,null,null,null,null,null,null,null,null,null,null,null,null,null,null,null,null,null,null,null,null,null,null,null,null,null,null,null,null,{"$f":"IF(入力シート!U7=TRUE,\"入力\",\"0\")","v":"0"}]
[null,"住宅金融支援機構「マンションすまい・る債」登録内容の変更届出書",null,null,null,null,null,null,null,null,null,null,null,null,null,null,null,null,null,null,null,null,null,null,null,null,null,null,null,null,null,null,null,null,null,null,null,null,null,null,null,null,null,null,null,null,null,null,null,null,null,null,null,null,null,null,null,null,null,null,null,null,null,null,null,null,null,null,null,null,null,null,null,null,null,null,null,null,{"$f":"IF(入力シート!J9=TRUE,\"入力\",\"0\")","v":"0"}]
[]
[null,"下記太枠内についてもれなくご記入ください。\n変更がある項目については、所定の欄にもご記入ください。"]
[]
[null,"住宅金融支援機構",null,null,null,null,null,null,null,null,null,null,null,null,null,null,null,null,null,null,null,null,null,null,null,"※\n\n\n\n","15日までに送付（消印有効）され、かつ、20日までにみずほ銀行資本市場部に到着し、同日までに不備なく処理が終了した変更内容が翌月から反映されます。\n\n"]
[null,"株式会社みずほ銀行（事務受託銀行）資本市場部　御中"]
[]
[null,"記入日",null,null,null,null,null,"西暦",null,{"$f":"IF(入力シート!$H$11=\"\",\"\",入力シート!$H$11)","v":""},null,null,"年",{"$f":"IF(入力シート!$K$11=\"\",\"\",入力シート!$K$11)","v":""},null,"月",{"$f":"IF(入力シート!$N$11=\"\",\"\",入力シート!$N$11)","v":""},null,"日"]
[null,"積立組合番号",null,null,null,null,null,{"$f":"IF(入力シート!$H$13=\"\",\"\",入力シート!$H$13)","v":""},null,null,null,null,null,"法人登記有無",null,null,null,null,null,{"$f":"IF(入力シート!$H$15=\"\",\"\",入力シート!$H$15)","v":""}]
[]
[null,"積立組合\n名称",null,null,null,null,null,null,null,"（登録済の情報）\n　フリガナ",null,null,null,null,null,{"$f":"IF(入力シート!$K$17=\"\",\"\",入力シート!$K$17)","v":""}]
[null,null,null,null,null,null,null,null,null,null,null,null,null,null,null,{"$f":"IF(入力シート!$K$18=\"\",\"\",入力シート!$K$18)","v":""}]
[null,{"$f":"IF(入力シート!$U$8=TRUE,\"変更あり\",\"変更なし\")","v":"変更なし"},null,null,null,null,null,null,null,"（変更後）\n　フリガナ",null,null,null,null,null,{"$f":"IF(入力シート!$U$8=FALSE,\"\",入力シート!$K$19)","v":""}]
[null,null,null,null,null,null,null,null,null,null,null,null,null,null,null,{"$f":"IF(入力シート!$U$8=FALSE,\"\",入力シート!$K$20)","v":""}]
[]
[null,"代表者氏名\n・住所等",null,null,null,null,null,null,"変更なし↓登録済の情報","変更あり↓変更後の情報","氏名","　フリガナ",null,null,null,{"$f":"IF(入力シート!$K$22=\"\",\"\",入力シート!$K$22)","v":""}]
[null,null,null,null,null,null,null,null,null,null,null,null,null,null,null,{"$f":"IF(入力シート!$K$23=\"\",\"\",入力シート!$K$23)","v":""}]
[null,{"$f":"IF(入力シート!$J$7=TRUE,\"変更あり\",\"変更なし\")","v":"変更なし"},null,null,null,null,null,null,null,null,"住所等","〒",{"$f":"IF(入力シート!$M$24=\"\",\"\",入力シート!$M$24)","v":""},null,null,"－",{"$f":"IF(入力シート!$P$24=\"\",\"\",入力シート!$P$24)","v":""},null,null,null,{"$f":"入力シート!$M$25&入力シート!$M$26","v":""}]
[null,null,null,null,null,null,null,null,null,null,null,"区町村名\n番地",null,null,null,{"$f":"IF(入力シート!$M$27=\"\",\"\",入力シート!$M$27)","v":""}]
[null,null,null,null,null,null,null,null,null,null,null,"号室等",null,null,null,{"$f":"IF(OR(入力シート!$M$28=\"\",入力シート!$BD$28=1),\"\",入力シート!$M$28)","v":""}]
[null,null,null,null,null,null,null,null,null,null,null,"　TEL　",null,null,"（",{"$f":"IF(入力シート!$M$29=\"\",\"\",入力シート!$M$29)","v":""},null,null,null,null,"）","－","（",{"$f":"IF(入力シート!$Q$29=\"\",\"\",入力シート!$Q$29)","v":""},null,null,null,null,null,"）","－","（",{"$f":"IF(入力シート!$U$29=\"\",\"\",入力シート!$U$29)","v":""},null,null,null,null,null,"）"]
[]
[null,"積立組合所在地",null,null,null,null,null,null,"変更後","〒",{"$f":"IF(入力シート!$U$9=FALSE,\"\",入力シート!$M$48)","v":""},null,null,"－",{"$f":"IF(入力シート!$U$9=FALSE,\"\",入力シート!$P$48)","v":""},null,null,null,{"$f":"IF(入力シート!$U$9=FALSE,\"\",入力シート!$M$49&入力シート!$M$50)","v":""}]
[null,{"$f":"IF(入力シート!$U$9=TRUE,\"変更あり\",\"変更なし\")","v":"変更なし"},null,null,null,null,null,null,null,"区町村名\n番地",null,null,null,{"$f":"IF(入力シート!$U$9=FALSE,\"\",入力シート!$M$51)","v":""}]
[]
[]
[null,"届出印",null,null,null,null,null,null,"届出内容","旧届出印",null,null,null,null,null,null,"新届出印",null,null,null,null,null,null,null,"※届出印を変更される場合は、必ず、旧届出印と新届出印の\n　両方を押印願います。"]
[null,{"$f":"IF(入力シート!$U$7=TRUE,\"変更あり※\",\"変更なし\")","v":"変更なし"}]
[]
[]
[null,"管理会社等\nの連絡先",null,null,null,null,null,null,null,"管理会社名　※自主管理組合の場合は、管理組合事務所等",null,null,null,null,null,null,null,null,null,null,null,null,null,null,null,null,null,null,null,null,null,null,"（注)書類の送付先を管理会社としている場合で、管理会社の名称変更や住所移転があったとき、ご担当の管理会社が変更となったとき、又は自主管理に変更になったときは併せて「送付先指定(変更・中止)依頼書」の提出により送付先を変更する手続が必要です(担当者のみが変更となる場合は提出不要です。)。"]
[null,null,null,null,null,null,null,null,null,null,{"$f":"IF(入力シート!$J$8=FALSE,\"\",入力シート!$M$33)","v":""}]
[null,{"$f":"IF(入力シート!$J$8=TRUE,\"変更あり\",\"変更なし\")","v":"変更なし"},null,null,null,null,null,null,null,"住所",null,{"$f":"IF(入力シート!$J$8=FALSE,\"\",入力シート!$M$34&入力シート!$M$35)","v":""},null,null,null,null,null,null,{"$f":"IF(入力シート!$J$8=FALSE,\"\",入力シート!$M$36)","v":""}]
[null,null,null,null,null,null,null,null,null,"担当部署名",null,null,{"$f":"IF(OR(入力シート!$J$8=FALSE,入力シート!$AJ$33=TRUE),\"\",入力シート!$M$37)","v":""}]
[null,null,null,null,null,null,null,null,null,"担当者氏名",null,null,{"$f":"IF(OR(入力シート!$J$8=FALSE,入力シート!$AJ$33=TRUE),\"\",入力シート!$M$38)","v":""},null,null,null,null,null,null,null,null,"TEL（",null,{"$f":"IF(入力シート!$J$8=FALSE,\"\",IF(入力シート!$M$39=\"\",\"\",入力シート!$M$39))","v":""},null,")-(",{"$f":"IF(入力シート!$J$8=FALSE,\"\",IF(入力シート!$Q$39=\"\",\"\",入力シート!$Q$39))","v":""},null,")-(",{"$f":"IF(入力シート!$J$8=FALSE,\"\",IF(入力シート!$U$39=\"\",\"\",入力シート!$U$39))","v":""},null,"）"]
[]
[null,"元利金\n自動振込先\n口座",null,null,null,null,null,null,"変更後","　振込先\n（金融機関及び店舗名）",null,null,null,null,null,{"$f":"IF(入力シート!$J$9=FALSE,\"\",入力シート!$Q$41)","v":""},null,null,null,null,null,null,null,{"$f":"IF(入力シート!$J$9=FALSE,\"\",入力シート!$Q$42)","v":""},null,null,null,null,null,null,"左記(振込先、預金種目、口座番号)の変更には、「積立手帳」の提示が必要です。",null,null,null,"届出印"]
[null,null,null,null,null,null,null,null,null,"預金種目",null,null,{"$f":"IF(入力シート!$J$9=FALSE,\"\",入力シート!$M$43)","v":""},null,null,null,null,null,null,"口座番号",null,null,null,{"$f":"IF(入力シート!$J$9=FALSE,\"\",入力シート!$M$44)","v":""}]
[null,{"$f":"IF(入力シート!$J$9=TRUE,\"変更あり\",\"変更なし\")","v":"変更なし"},null,null,null,null,null,null,null,"預金口座\n名義",null,null,"フリガナ\n(必ずご記入ください)",null,null,null,null,{"$f":"IF(入力シート!$J$9=FALSE,\"\",入力シート!$P$45)","v":""}]
[null,null,null,null,null,null,null,null,null,null,null,null,null,null,null,null,null,{"$f":"IF(入力シート!$J$9=FALSE,\"\",入力シート!$P$46)","v":""}]
[]
[null,null,null,null,null,null,null,null,null,null,null,null,null,null,null,null,null,null,null,null,null,null,null,null,null,null,null,null,null,null,null,"元利金自動振込先口座を変更される場は、必ず届出印を押印ください。\n（注）金融機関届出印ではありません。\nただし、口座名義に代表者名が含まれており、代表者変更と同時に口座名義のみを変更する場合、届出印の押印は不要です。"]
[]
[]
[]
[null,"【元利金自動振込先口座を変更する場合は下記についてご誓約頂きますので、下記の内容を必ずご確認ください】"]
[null," 当マンション管理組合は、今後貴行において受領するマンションすまい・る債の元利金について、上記の預金口座への自動振込みを依頼します（上記預金口座を元利金自動振込先口座として指定します。）。なお、今後元利金自動振込先口座の変更が必要な場合には、速やかに届出を行いますので、振込みの度に貴行からの入金先確認の連絡は必要ありません。また、この依頼書の提出に当たっては、将来どのような事故が生じましても当マンション管理組合がその責任を負い、独立行政法人住宅金融支援機構及び貴行に対しましては一切ご迷惑、ご損害をおかけしません。"]
[]
[]
[]
[null,"銀行使用欄",null,null,"確認書類",null,null,"1.登記簿謄本又は全部事項証明書 　2.印鑑証明書 　3.住民票　 4.運転免許証コピー　 5.健康保険証コピー 　6.その他(       　　　　　　　  　　        　)"]
[null,"受付日",null,null,null,null,null,null,null,"振込先\n銀行店コード",null,null,null,null,null,null,null,null,null,null,null,null,null,null,null,null,null,null,"備考"]
[null,"権限者",null,null,null,"再鑑者",null,null,null,null,"担当者"]
[null,null,null,null,null,null,null,null,null,null,null,null,null,null,null,null,null,null,null,null,null,null,"機構使用欄",null,null,5]

{"sheet":"入力方法等のご案内","index":2,"n_rows":49,"n_cols":6,"rows_kept":49,"cut":false,"hidden":false,"merged":[[1,1,2,12],[29,3,39,11],[48,2,52,11]]}
[]
[null,"本ツールの入力方法やご注意点に関するご案内"]
[]
[null,"１　入力方法"]
[null,null,"①　「入力シート」の各項目に入力をお願いします。"]
[null,null,"　　プルダウンリストから選択いただく項目と直接入力いただく項目があります。"]
[null,null,"　　入力セルの色分けは次のとおりです。"]
[]
[null,null,null,null,null,"必ず入力いただく項目です。"]
[null,null,null,null,null,"入力不要です。"]
[]
[]
[null,null,"②　全ての項目の入力が終わりましたら、「エラーチェック」ボタンを押してください。"]
[null,null,"　②－１　エラーがある場合"]
[null,null,"　　セルが赤く反転するとともに、エラーメッセージが表示されます。"]
[null,null,"　　内容をご確認いただき、追加入力や修正をお願いします。"]
[null,null,"　　修正が終わりましたら、再度「エラーチェック」ボタンを押し、エラーの有無をご確認ください。"]
[null,null,"　②－２　エラーがない場合"]
[null,null,"　　「エラーはありません。（以下略）」というメッセージが表示されます。"]
[]
[null,null,"③　エラーがない場合、「出力シート」の「印刷」ボタンを押して印刷してください。２枚出力されます。"]
[]
[null,null,"④　再度内容をご確認いただき、「事務受託銀行（みずほ銀行）送付用」を以下の送付先に"]
[null,null,"　　他の必要書類とともにご郵送ください。"]
[null,null,"　　「届出印」または「元利金自動振込先口座」を変更する場合は、届出印を忘れずに"]
[null,null,"　　押印ください。ただし、口座名義に代表者名が含まれており、代表者変更と同時に"]
[null,null,"    口座名義のみを変更する場合、届出印の押印は不要です。"]
[null,null,"　※「マンション管理組合保管用」はお手元にて大切に保管してください。"]
[]
[null,null,null,"＜郵送先＞　〒100-8241\n　  東京都千代田区丸の内1-3-3 みずほ丸の内タワー\n　　  みずほ銀行　資本市場部　業務第二チーム\n\n＜本ツールに関するお問合せ＞　\n　住宅金融支援機構住宅債券事務センター\n  ０３－５８００－９４７９（通話料金がかかります。）\n　　営業時間　９：００～１７：００（土日、祝日、年末年始は休業）"]
[]
[]
[]
[]
[]
[]
[]
[]
[]
[]
[]
[null,"２　ご注意点"]
[null,null,"①「エラーチェック」ボタンを押し、エラーがない状態でないと印刷できません。"]
[null,null,"②入力項目によっては、文字数制限があります。"]
[null,null,"③入力いただくセル以外は、加工・編集ができません。ご了承ください。"]
[null,null,"④書類の送付先を管理会社としている場合で、ご担当の管理会社が変更となったときは、"]
[null,null,"　併せて「送付先指定（変更・中止）依頼書」の提出により送付先を変更する手続が必要です。"]
[]
[null,null,"上記以外のご注意点\n○本ツールは、『住宅金融支援機構「マンションすまい・る債」登録内容の変更届出書（以下「変更届出書」\n　といいます。）』作成のためのサポートツールです。本ツールは、変更届出書の完全性を保証する\n　ものではありませんので、変更届出書提出に当たっては、貴組合で十分内容のチェックをお願いします。\n○独立行政法人住宅金融支援機構は、因果関係の有無にかかわらず、本ツールの使用により発生した損害、\n　逸失利益等一切の不利益について責任を負いません。"]

{"sheet":"必要書類","index":3,"n_rows":48,"n_cols":6,"rows_kept":48,"cut":false,"hidden":false,"merged":[[44,2,44,10],[47,2,52,10],[2,3,2,10],[3,2,35,2],[32,4,32,10],[38,2,43,2],[40,3,40,10],[41,3,41,10],[42,3,42,10],[43,3,43,10]]}
[]
[]
[null,null,"変更の内容","変更手続に必要な添付書類"]
[null,null,"代表者の\n氏名・住所","①総会議事録"]
[null,null,null,null,"記載事項  ：組合名称、総会開催日、定足数を満たす参加者が出席し決議が有効であるこ"]
[null,null,null,null,null,"と、役員選任の内容（役員名、役職名）、議長及び総会に出席した組合員"]
[null,null,null,null,null,"２名以上の署名があること。"]
[null,null,null,"※　選任された役員名の記載がない場合は、議案書も添付してください。"]
[null,null,null,"※　役職の記載がない場合は、理事会議事録も添付してください。"]
[]
[null,null,null,"②新代表者の方の氏名・住所・生年月日が記載された書類"]
[null,null,null,"次のいずれか１つ"]
[null,null,null,null,"・運転免許証のコピー（表裏両面）"]
[null,null,null,null,"・2012年４月１日以後に交付された運転経歴証明書のコピー（表裏両面）"]
[null,null,null,null,"・資格確認証のコピー（住所の記載のあるもの）"]
[null,null,null,null,"　※マイナ保険証（健康保険証の利用登録をしたマイナンバーカード）を保有していな"]
[null,null,null,null,"　　い方に交付される資格確認書類です。"]
[null,null,null,null,"・健康保険証のコピー（住所の記載のあるもの）"]
[null,null,null,null,"    　ただし、2025年12月１日までの書類到着分（それより前に有効期限が到来する場"]
[null,null,null,null,"　合は、有効期限までの書類到着分）に限ります。"]
[null,null,null,null,"・印鑑証明書（発行後３か月以内の原本）"]
[null,null,null,null,"・住民票（発行後３か月以内の原本、マイナンバーの記載がないもの）"]
[null,null,null,null,"・住民基本台帳カードのコピー（表裏両面）"]
[null,null,null,null,"・2020年２月３日以前に申請されたパスポートのコピー（顔写真のページ及び所持人"]
[null,null,null,null,"    記入欄（住所等記入済）のページ）"]
[null,null,null,null,"・マイナンバーカードのコピー（表面のみ）"]
[null,null,null,"※　②の書類につきましては、個人情報の保護の観点により、本籍地を黒塗りしたもの"]
[null,null,null,null,"又は本籍地の記載を省略したものをご準備ください。"]
[null,null,null,null,"（本籍地を黒塗りすることにより住所地が確認できなくなる場合は、黒塗りにしない"]
[null,null,null,null,"ようお願いします。）また、資格確認証のコピー又は健康保険証のコピーをご提出い"]
[null,null,null,null,"ただく場合は、保険者番号・被保険者記号・被保険者番号・二次元コードを黒塗りし"]
[null,null,null,null,"たものをご準備ください。"]
[]
[null,null,null,"※　法人登記している積立組合の場合、①に代えて登記事項証明書（発行後３か月以内・"]
[null,null,null,"　　コピー可）をご提出いただくことも可能です。"]
[]
[null,null,"届出印","添付書類は不要です。"]
[null,null,"管理会社等\nの連絡先","添付書類は不要です。"]
[null,null,"元利金\n自動振込先口座","積立手帳（原本）"]
[null,null,null,"※　複数の積立をされている場合は全ての積立手帳が必要です。"]
[null,null,null,"※　金融機関やその支店の統合により金融機関、支店又は口座番号が変わる場合（口座名"]
[null,null,null,"　義の変更無し）は、金融機関が発行する証明書類の写しがあれば積立手帳は不要です。"]
[null,null,null,"※　代表者変更手続に伴う元利金自動振込先口座変更で、金融機関、預金種目及び口座番"]
[null,null,null,"　号に変更がなく、口座名義の代表者名のみが変更になる場合は積立手帳は不要です。"]
[null,null,"その他の変更、詳細につきましては、「マンションすまい・る債のしおり（積立手帳別冊）」又は機構ホームページをご確認ください。\n"]
[]
[null,null,"送付先"]
[null,null,"　　〒１００－８２４１ \n　　　　　東京都千代田区丸の内1-3-3　みずほ丸の内タワー\n　　　　（事務受託銀行）　株式会社みずほ銀行　　資本市場部業務第ニチーム\n"]

{"sheet":"プルダウンリスト","index":4,"n_rows":32,"n_cols":12,"rows_kept":32,"cut":false,"hidden":true,"merged":[]}
[]
[null,"変更あり",null,1,null,2021,null,"区",null,"1) 普通",null,"無"]
[null,"変更なし",null,2,null,2022,null,"市",null,"2) 当座",null,"有"]
[null,null,null,3,null,2023,null,"郡"]
[null,null,null,4,null,2025]
[null,null,null,5,null,2026]
[null,null,null,6,null,2027,null,"　（自主管理組合）"]
[null,null,null,7,null,2028]
[null,null,null,8,null,2029]
[null,null,null,9,null,2030]
[null,null,null,10,null,2031]
[null,null,null,11]
[null,null,null,12]
[null,null,null,13]
[null,null,null,14]
[null,null,null,15]
[null,null,null,16]
[null,null,null,17]
[null,null,null,18]
[null,null,null,19]
[null,null,null,20]
[null,null,null,21]
[null,null,null,22]
[null,null,null,23]
[null,null,null,24]
[null,null,null,25]
[null,null,null,26]
[null,null,null,27]
[null,null,null,28]
[null,null,null,29]
[null,null,null,30]
[null,null,null,31]

{"sheet":"郵便番号","index":5,"n_rows":948,"n_cols":3,"rows_kept":948,"cut":false,"hidden":true,"merged":[]}
["060","北海道","ﾎｯｶｲﾄﾞｳ"]
["064","北海道","ﾎｯｶｲﾄﾞｳ"]
["001","北海道","ﾎｯｶｲﾄﾞｳ"]
["002","北海道","ﾎｯｶｲﾄﾞｳ"]
["065","北海道","ﾎｯｶｲﾄﾞｳ"]
["007","北海道","ﾎｯｶｲﾄﾞｳ"]
["003","北海道","ﾎｯｶｲﾄﾞｳ"]
["062","北海道","ﾎｯｶｲﾄﾞｳ"]
["005","北海道","ﾎｯｶｲﾄﾞｳ"]
["061","北海道","ﾎｯｶｲﾄﾞｳ"]
["063","北海道","ﾎｯｶｲﾄﾞｳ"]
["004","北海道","ﾎｯｶｲﾄﾞｳ"]
["006","北海道","ﾎｯｶｲﾄﾞｳ"]
["040","北海道","ﾎｯｶｲﾄﾞｳ"]
["041","北海道","ﾎｯｶｲﾄﾞｳ"]
["042","北海道","ﾎｯｶｲﾄﾞｳ"]
["047","北海道","ﾎｯｶｲﾄﾞｳ"]
["048","北海道","ﾎｯｶｲﾄﾞｳ"]
["070","北海道","ﾎｯｶｲﾄﾞｳ"]
["079","北海道","ﾎｯｶｲﾄﾞｳ"]
["071","北海道","ﾎｯｶｲﾄﾞｳ"]
["078","北海道","ﾎｯｶｲﾄﾞｳ"]
["074","北海道","ﾎｯｶｲﾄﾞｳ"]
["050","北海道","ﾎｯｶｲﾄﾞｳ"]
["051","北海道","ﾎｯｶｲﾄﾞｳ"]
["085","北海道","ﾎｯｶｲﾄﾞｳ"]
["084","北海道","ﾎｯｶｲﾄﾞｳ"]
["088","北海道","ﾎｯｶｲﾄﾞｳ"]
["080","北海道","ﾎｯｶｲﾄﾞｳ"]
["089","北海道","ﾎｯｶｲﾄﾞｳ"]
["090","北海道","ﾎｯｶｲﾄﾞｳ"]
["099","北海道","ﾎｯｶｲﾄﾞｳ"]
["093","北海道","ﾎｯｶｲﾄﾞｳ"]
["091","北海道","ﾎｯｶｲﾄﾞｳ"]
["068","北海道","ﾎｯｶｲﾄﾞｳ"]
["069","北海道","ﾎｯｶｲﾄﾞｳ"]
["077","北海道","ﾎｯｶｲﾄﾞｳ"]
["053","北海道","ﾎｯｶｲﾄﾞｳ"]
["059","北海道","ﾎｯｶｲﾄﾞｳ"]
["066","北海道","ﾎｯｶｲﾄﾞｳ"]
["097","北海道","ﾎｯｶｲﾄﾞｳ"]
["098","北海道","ﾎｯｶｲﾄﾞｳ"]
["072","北海道","ﾎｯｶｲﾄﾞｳ"]
["075","北海道","ﾎｯｶｲﾄﾞｳ"]
["076","北海道","ﾎｯｶｲﾄﾞｳ"]
["067","北海道","ﾎｯｶｲﾄﾞｳ"]
["094","北海道","ﾎｯｶｲﾄﾞｳ"]
["095","北海道","ﾎｯｶｲﾄﾞｳ"]
["096","北海道","ﾎｯｶｲﾄﾞｳ"]
["087","北海道","ﾎｯｶｲﾄﾞｳ"]
["086","北海道","ﾎｯｶｲﾄﾞｳ"]
["073","北海道","ﾎｯｶｲﾄﾞｳ"]
["052","北海道","ﾎｯｶｲﾄﾞｳ"]
["044","北海道","ﾎｯｶｲﾄﾞｳ"]
["049","北海道","ﾎｯｶｲﾄﾞｳ"]
["043","北海道","ﾎｯｶｲﾄﾞｳ"]
["045","北海道","ﾎｯｶｲﾄﾞｳ"]
["046","北海道","ﾎｯｶｲﾄﾞｳ"]
["092","北海道","ﾎｯｶｲﾄﾞｳ"]
["054","北海道","ﾎｯｶｲﾄﾞｳ"]
{"$rows_left_out":888}