{"text_format":"1","workbook":"xlsx","n_sheets":4,"sheets":["入力シート","出力シート","プルダウンリスト","郵便番号バックデータ"],"not_rendered":{"charts":0,"images":0,"macros":1,"external_links":0,"defined_names":2,"comments":0,"pivot_tables":0},"unopened":[],"bounds":{"document_bytes":16777216,"sheet_cells":100000,"rows_first":2000,"rows_last":500,"rows_between":2000,"halvings":0,"cell_chars":16384,"cell_head_chars":4096},"cells_cut":0,"cells_raw":0,"read":"whole","date_system":"1900"}

{"sheet":"入力シート","index":0,"n_rows":39,"n_cols":64,"rows_kept":39,"cut":false,"hidden":false,"merged":[[26,36,27,49],[27,15,27,26],[38,2,38,28],[16,1,16,9],[11,18,11,20],[11,10,11,14],[11,1,14,9],[11,15,11,16],[12,15,12,20],[13,15,13,20],[14,15,14,37],[16,10,16,20],[26,15,26,18],[30,10,30,37],[29,10,29,26],[29,1,29,9],[30,2,30,9],[18,1,18,9],[24,1,27,9],[22,19,22,21],[27,10,27,14],[25,11,25,14],[26,11,26,14],[25,15,25,18],[24,10,24,14],[20,1,22,9],[24,15,24,20],[21,10,21,14],[21,15,21,25],[22,23,22,25],[20,15,20,25],[22,15,22,17],[20,10,20,14],[1,15,1,19],[2,15,2,19],[22,10,22,14],[18,10,18,29],[12,10,12,14],[13,10,13,14],[14,10,14,14],[12,21,13,42],[16,39,19,51],[4,7,4,8],[6,7,6,16],[8,1,9,9],[1,1,2,12],[4,1,4,6],[4,10,4,11],[4,13,4,14],[6,1,6,6],[8,10,9,37]]}
[null,null,null,null,null,null,null,null,null,null,null,null,null,null,null,null,null,null,null,null,null,null,null,null,null,null,null,null,null,null,null,null,null,null,null,null,null,null,null,null,null,null,null,null,null,null,null,null,null,null,null,null,null,null,null,null,null,null,null,null,null,null,null,0]
[null,"入力シート",null,null,null,null,null,null,null,null,null,null,null,null,null,null,null,null,null,null,"黄色のセルは必ず入力いただく項目です。"]
[null,null,null,null,null,null,null,null,null,null,null,null,null,null,null,null,null,null,null,null,"セルが黒く反転した場合は、入力不要です。"]
[]
[null,"記入日",null,null,null,null,null,null,null,"年",null,null,"月",null,null,"日","←プルダウンから選択してください。"]
[]
[null,"積立手帳番号",null,null,null,null,null,null,null,null,null,null,null,null,null,null,null,"3から始まる10桁の番号"]
[]
[null,"マンション管理組合の名称"]
[]
[]
[null,"マンションの所在地\n（住居表示上の住所）",null,null,null,null,null,null,null,null,"郵便番号",null,null,null,null,"",null,"－",""]
[null,null,null,null,null,null,null,null,null,null,"都道府県",null,null,null,null,{"$f":"IF(P12=\"\",\"\",VLOOKUP(TEXT(P12,\"000\"),郵便番号バックデータ!A1:C948,2,0))","v":""},null,null,null,null,null,"←郵便番号（上３桁）から自動表示されます。\n   自動表示される都道府県名が異なる場合は、お手数ですが、直接入力願います。"]
[null,null,null,null,null,null,null,null,null,null,"市・区・郡"]
[null,null,null,null,null,null,null,null,null,null,"区町村名・番地"]
[]
[null,"代表者氏名",null,null,null,null,null,null,null,null,null,null,null,null,null,null,null,null,null,null,null,"←「姓名」の間にスペース（全角）を入力してください。",null,null,null,null,null,null,null,null,null,null,null,null,null,null,null,null,null,{"$f":"IF(入力シート!K19=プルダウンリスト!F3,\"①債券買入請求書（本書式）と併せて、②積立手帳　③買入請求すること、買入請求する金額及び買入請求する理由が記載されている総会議事録等をご提出ください。\",IF(入力シート!K19=プルダウンリスト!F4,\"①債券買入請求書（本書式）と併せて、②積立手帳をご提出ください。※会計担当役等の方に電話にて買入の意思確認を行います。\",\"\"))","v":""}]
[]
[null,"意思確認の方法",null,null,null,null,null,null,null,null,null,null,null,null,null,null,null,null,null,null,null,null,null,null,null,null,null,null,null,null,"←プルダウンから選択してください。"]
[]
[null,"会計担当役員等の連絡先",null,null,null,null,null,null,null,null,{"$f":"IF(K19=プルダウンリスト!F3,\"入力不要\",\"氏名（フリガナ）\")","v":"氏名（フリガナ）"},null,null,null,null,null,null,null,null,null,null,null,null,null,null,null," ←「姓名」の間にスペース（半角）を入力のうえ、15文字以下で入力願います。"]
[null,null,null,null,null,null,null,null,null,null,{"$f":"IF(K19=プルダウンリスト!F3,\"入力不要\",\"氏名（漢字）\")","v":"氏名（漢字）"},null,null,null,null,null,null,null,null,null,null,null,null,null,null,null," ←「姓名」の間にスペース（全角）を入力のうえ、15文字以下で入力願います。"]
[null,null,null,null,null,null,null,null,null,null,{"$f":"IF(K19=プルダウンリスト!F3,\"入力不要\",\"電話番号\")","v":"電話番号"},null,null,null,null,"",null,null,"－","",null,null,"－","",null,null,"←日中に連絡が取れる役員等の連絡先をご記入ください"]
[]
[null,"買入請求の内容",null,null,null,null,null,null,null,null,"買入請求額",null,null,null,null,null,null,null,null,null,null,"←プルダウンから選択してください。"]
[null,null,null,null,null,null,null,null,null,null,null,{"$f":"IF(P25=プルダウンリスト!F6,\"入力不要\",\"口数\")","v":"口数"},null,null,null,null,null,null,null,"口"]
[null,null,null,null,null,null,null,null,null,null,null,{"$f":"IF(P25=プルダウンリスト!F6,\"入力不要\",\"金額\")","v":"金額"},null,null,null,{"$f":"P26*50","v":0},null,null,null,"万円",null,"←口数に応じて自動的に金額が計算されます。",null,null,null,null,null,null,null,null,null,null,null,null,null,null,{"$f":"IF(P25=プルダウンリスト!F7,\"\",IF(P28=プルダウンリスト!F10,\"「今後の積立継続を継続しない」を選択した場合、今後積立用書類は送付されませんのでご注意ください。\",\"\"))","v":""}]
[null,null,null,null,null,null,null,null,null,null,{"$f":"IF(P25=プルダウンリスト!F7,\"入力不要\",\"積立継続希望\")","v":"積立継続希望"},null,null,null,null,null,null,null,null,null,null,null,null,null,null,null,null,"←プルダウンから選択してください。"]
[]
[null,"買入の理由",null,null,null,null,null,null,null,null,null,null,null,null,null,null,null,null,null,null,null,null,null,null,null,null,null,"←プルダウンから選択してください。"]
[null,null,{"$f":"IF(OR(K30=プルダウンリスト!F12,K30=プルダウンリスト!F13),\"入力不要\",\"その他の場合の具体的な理由\")","v":"その他の場合の具体的な理由"},null,null,null,null,null,null,null,null,null,null,null,null,null,null,null,null,null,null,null,null,null,null,null,null,null,null,null,null,null,null,null,null,null,null,null,"←その他の場合のみ記入ください。"]
[]
[null,null,"入力項目は以上です。入力もれがないかどうか、↓の「エラーチェック」ボタンを押して、ご確認ください。"]
[]
[]
[]
[]
[]
[null,null,"エラーチェック後、入力もれ等がある場合は、該当のセルが赤く反転します。ご確認をお願いします。"]

{"sheet":"出力シート","index":1,"n_rows":70,"n_cols":64,"rows_kept":70,"cut":false,"hidden":false,"merged":[[64,2,64,9],[65,2,65,9],[44,13,44,28],[30,26,31,28],[30,30,31,33],[42,2,46,6],[33,2,34,38],[30,35,31,38],[40,12,40,14],[40,16,40,19],[30,24,31,25],[30,34,31,34],[37,2,41,6],[11,29,12,29],[11,33,12,33],[11,34,12,34],[11,31,12,31],[23,2,25,3],[23,4,25,38],[1,2,1,29],[26,2,31,3],[26,4,28,38],[29,5,31,9],[30,10,31,23],[7,26,7,27],[7,28,7,30],[7,32,7,33],[7,35,7,36],[11,35,12,35],[11,36,12,36],[11,37,12,37],[15,2,16,6],[13,4,14,6],[13,32,16,32],[18,2,19,38],[2,2,4,38],[11,7,12,23],[30,29,31,29],[11,32,12,32],[11,24,12,27],[29,15,29,23],[11,28,12,28],[13,33,16,38],[13,8,13,9],[13,11,13,13],[14,8,14,31],[15,9,16,29],[11,2,14,3],[11,4,12,6],[11,38,12,38],[11,30,12,30]]}
[null,null,"※太枠の中を記入・押印し、１部をみずほ銀行（事務受託銀行）あて送付してください。もう１部は控えとして大切に保管してください。",null,null,null,null,null,null,null,null,null,null,null,null,null,null,null,null,null,null,null,null,null,null,null,null,null,null,null,null,null,null,null,null,null,null,null,null,null,null,null,null,null,null,null,null,null,null,null,null,null,null,null,null,null,null,null,null,null,null,null,null,0]
[null,null,"送付先：みずほ銀行資本市場部業務第二チーム\n〒100-8241　東京都千代田区丸の内1-3-3　みずほ丸の内タワー 　TEL：03-5252-6017",null,null,null,null,null,null,null,null,null,null,null,null,null,null,null,null,null,null,null,null,null,null,null,null,null,null,null,null,null,null,null,null,null,null,null,null,null,null,null,null,null,null,null,null,null,null,null,null,null,null,null,null,null,null,null,null,null,null,null,null,0]
[null,null,"住宅金融支援機構「マンションすまい・る債」\n債券買入請求書（中途換金）"]
[]
[]
[]
[null,null,"独立行政法人住宅金融支援機構　御中"]
[null,null,null,null,null,null,null,null,null,null,null,null,null,null,null,null,null,null,null,null,null,null,null,null,null,null,"西暦",null,{"$f":"IF(入力シート!H5=\"\",\"\",入力シート!H5)","v":""},null,null,"年",{"$f":"IF(入力シート!K5=\"\",\"\",入力シート!K5)","v":""},null,"月",{"$f":"IF(入力シート!N5=\"\",\"\",入力シート!N5)","v":""},null,"日"]
[null,null,null,"私どもマンション管理組合が積み立てている「マンションすまい・る債」の買入消却を、下記の内容のとおり請求します。"]
[]
[null,null,"（申請者）"]
[null,null,"積立組合",null,"名称",null,null,{"$f":"IF(入力シート!K9=\"\",\"\",入力シート!K9)","v":""},null,null,null,null,null,null,null,null,null,null,null,null,null,null,null,null,"積立手帳\n番号",null,null,null,{"$f":"IF(入力シート!H7=\"\",\"\",MID(入力シート!H7,1,1))","v":""},{"$f":"IF(入力シート!H7=\"\",\"\",MID(入力シート!H7,2,1))","v":""},{"$f":"IF(入力シート!H7=\"\",\"\",MID(入力シート!H7,3,1))","v":""},{"$f":"IF(入力シート!H7=\"\",\"\",MID(入力シート!H7,4,1))","v":""},{"$f":"IF(入力シート!H7=\"\",\"\",MID(入力シート!H7,5,1))","v":""},{"$f":"IF(入力シート!H7=\"\",\"\",MID(入力シート!H7,6,1))","v":""},"-",{"$f":"IF(入力シート!H7=\"\",\"\",MID(入力シート!H7,7,1))","v":""},{"$f":"IF(入力シート!H7=\"\",\"\",MID(入力シート!H7,8,1))","v":""},{"$f":"IF(入力シート!H7=\"\",\"\",MID(入力シート!H7,9,1))","v":""},{"$f":"IF(入力シート!H7=\"\",\"\",MID(入力シート!H7,10,1))","v":""}]
[]
[null,null,null,null,"所在地",null,null,"〒",{"$f":"IF(入力シート!P12=\"\",\"\",入力シート!P12)","v":""},null,"－",{"$f":"IF(入力シート!S12=\"\",\"\",入力シート!S12)","v":""},null,null,null,null,null,null,null,null,null,null,null,null,null,null,null,null,null,null,null,null,"届出印"]
[null,null,null,null,null,null,null,null,{"$f":"入力シート!P13&入力シート!P14&入力シート!P15","v":""}]
[null,null,"代表者氏名",null,null,null,null,null,null,{"$f":"IF(入力シート!K17=\"\",\"\",入力シート!K17)","v":""}]
[]
[null,null,"（注１）「積立手帳番号」欄には、買入請求する積立手帳番号をご記入ください。複数の積立手帳にわたる場合は、積立手帳番号ごとに作成してください。"]
[null,null,"（注２）「名称」・「所在地」・「代表者氏名」欄には、現在届け出られている内容を最新の「残高証明書」等でご確認の上、ご記入ください。なお、代表者\n　　　　氏名に変更がある場合には、変更後の内容でご記入ください。別途、代表者変更手続が必要です。"]
[]
[null,null,"（注３）「届出印」欄には、お届け印を押印してください。"]
[]
[null,null,"（意思決定に関する確認方法）　どちらかの方法（□欄）に✔をご記入の上、必要項目をご記入ください。"]
[null,null,{"$f":"IF(入力シート!K19=プルダウンリスト!F3,\"✔\",\"\")","v":""},null,"1.買入請求（中途換金）の実施を決定した総会の議事録等を提出する。\n　 ※ご提出いただく総会議事録等に、マンションすまい・る債を買入請求すること、買入請求する金額及び\n　　　買入請求する理由が記載されている必要があります。"]
[]
[]
[null,null,{"$f":"IF(入力シート!K19=プルダウンリスト!F4,\"✔\",\"\")","v":""},null,"2.会計担当役員等（下欄に記入）への電話による意思確認を希望する。"]
[]
[]
[null,null,null,null,null,"会計担当役員等の\n連絡先",null,null,null,null,"（フリガナ）",null,null,null,null,{"$f":"IF(入力シート!K19=プルダウンリスト!F3,\"\",IF(入力シート!K19=プルダウンリスト!F4,入力シート!P21,\"\"))","v":""},null,null,null,null,null,null,null,null,"※日中に連絡が取れる役員等の連絡先をご記入ください"]
[null,null,null,null,null,null,null,null,null,null,{"$f":"IF(入力シート!K19=プルダウンリスト!F3,\"\",IF(入力シート!K19=プルダウンリスト!F4,入力シート!P22,\"\"))","v":""},null,null,null,null,null,null,null,null,null,null,null,null,null,"電話",null,{"$f":"IF(入力シート!K19=プルダウンリスト!F3,\"\",IF(入力シート!K19=プルダウンリスト!F4,入力シート!P23,\"\"))","v":""},null,null,"-",{"$f":"IF(入力シート!K19=プルダウンリスト!F3,\"\",IF(入力シート!K19=プルダウンリスト!F4,入力シート!T23,\"\"))","v":""},null,null,null,"-",{"$f":"IF(入力シート!K19=プルダウンリスト!F3,\"\",IF(入力シート!K19=プルダウンリスト!F4,入力シート!X23,\"\"))","v":""}]
[]
[null,null,"（注１）買入請求希望時期等の都合で、総会議事録等の作成が間に合わない等、提出が難しい場合は、「2.」を選択ください。"]
[null,null,"（注２）「2.」を希望する場合、「会計担当役員等の連絡先」欄には、現在の会計担当役員など、理事長以外の役員等氏名を必ずご記入ください。\n　　　　機構から買入請求の意思確認をさせていただきます。"]
[]
[]
[null,null,"（買入請求の内容）　選択する番号、内容の□欄に✔をご記入の上、必要項目をご記入ください。"]
[null,null,"買入請求額",null,null,null,null,{"$f":"IF(入力シート!P25=プルダウンリスト!F6,\"✔\",\"\")","v":""},"１．全部　（今後の積立継続を",null,null,null,null,null,null,null,null,null,{"$f":"IF(入力シート!P25=プルダウンリスト!F7,\"\",IF(入力シート!P28=プルダウンリスト!F9,\"✔\",\"\"))","v":""},"希望する",null,null,null,{"$f":"IF(入力シート!P25=プルダウンリスト!F7,\"\",IF(入力シート!P28=プルダウンリスト!F10,\"✔\",\"\"))","v":""},"希望しない",null,null,null,"）"]
[null,null,null,null,null,null,null,null,null,null,"　　　 ・この欄にご記入されていない場合は、積立継続希望とさせていただきます。"]
[null,null,null,null,null,null,null,null,null,null,"　　 　・10回の積立てを完了又は積立てを中止している場合は、「希望しない」の□欄に✔をご記入ください。"]
[null,null,null,null,null,null,null,{"$f":"IF(入力シート!P25=プルダウンリスト!F7,\"✔\",\"\")","v":""},"２．一部　（",null,null,null,{"$f":"IF(入力シート!P25=プルダウンリスト!F6,\"\",IF(入力シート!P25=プルダウンリスト!F7,入力シート!P26,\"\"))","v":""},null,null,"口",{"$f":"IF(入力シート!P25=プルダウンリスト!F6,\"\",IF(入力シート!P25=プルダウンリスト!F7,入力シート!P27,\"\"))","v":""},null,null,null,"万円）"]
[null,null,null,null,null,null,null,null,null,null,"　　　 ・１口から買入可能です。１口あたりの金額は、50万円です。"]
[null,null,"買入れの理由",null,null,null,null,{"$f":"IF(入力シート!K30=プルダウンリスト!F12,\"✔\",\"\")","v":""},"１．共用部分の修繕工事費用に充てる。"]
[null,null,null,null,null,null,null,{"$f":"IF(入力シート!K30=プルダウンリスト!F13,\"✔\",\"\")","v":""},"２．共用部分の修繕工事に係る借入金の返済に充てる。"]
[null,null,null,null,null,null,null,{"$f":"IF(入力シート!K30=プルダウンリスト!F14,\"✔\",\"\")","v":""},"３．その他",null,null,null,"[",{"$f":"IF(OR(入力シート!K30=プルダウンリスト!F12,プルダウンリスト!F13),\"\",IF(入力シート!K30=プルダウンリスト!F14,入力シート!K31,\"\"))","v":""},null,null,null,null,null,null,null,null,null,null,null,null,null,null,null,"]","（例：管理組合が解散する）"]
[null,null,null,null,null,null,null,null,null,"※「３．その他」を選択された場合、マンションすまい・る債を買入請求すること、買入請求する金額及び"]
[null,null,null,null,null,null,null,null,null,"　　買入請求する理由の３点が記載されている総会の議事録等を提出する必要があります。"]
[null,null,"（注１）最新の「残高証明書」、「買入計算書」で現在の残高をご確認の上、買入請求額欄に必要事項をご記入ください。"]
[null,null,"（注２）買入請求額欄で「２．一部」を選択された場合、積み立てた時期の古い順に債券を買入消却します。"]
[null,null,"（注３）以下の月は中途換金額のお受取ができません。"]
[null,null,"　","・第２回から第10回までの購入に係る債券の各発行月及びその翌月"]
[null,null,null,"・満期償還月（発行から10年後の２月）"]
[]
[null,null,"【本請求書ご提出にあたって】"]
[null,null,"・買入請求のお手続きには、本請求書のほかに、「積立手帳」のご提出が必要です。"]
[null,null,"・積立組合の名称と積立手帳番号はお客さまを特定する大切な項目ですので、積立手帳と照合し、省略、記入もれ、お間違えのないように特にご注意ください。"]
[null,null,"・買入代金は、ご指定いただいている「元利金自動振込先口座」に振り込みます。"]
[null,null,"・本請求書と「積立手帳」を15日（消印有効）までに送付し、かつ、20日（銀行休業日に当たる場合は前営業日）までにみずほ銀行に到着し、内容に不備がなく"]
[null,null," 機構による買入請求の意思確認ができたものは、翌月10日（銀行休業日に当たる場合は前営業日）にお振り込みします。確認後に発送する買入計算書にて、買入内容と"]
[null,null," 振込予定日をご確認ください。"]
[null,null,"・「元利金自動振込先口座」に変更がある場合には、「登録内容の変更届出書」を併せてご提出願います。このお手続きが買入請求と同時にされなかった場合には、"]
[null,null," 買入代金の振込みが遅れたり、送金戻り及び再送金に係る組戻・振込手数料をいただくことがあります。"]
[]
[null,null,"（金融機関使用欄）"]
[null,null,"　　　買入意思確認済み",null,null,null,null,null,null,null,"（備考）"]
[null,null,"　　　電話に切替え"]
[null,null,"（機構使用欄）"]
[null,null,"確認日時　　　　　　　　年　　　　月　　　　日　　　　　：　　",null,null,null,null,null,null,null,null,null,null,null,null,null,null,null,null,null,null,null,null,null,"　買入請求額（ 承諾 ・ 否決 ）",null,null,null,null,null,null,null,"買入の理由（ 承諾 ・ 否決 ）"]
[null,null,"役員（　会計　・　副理事長　・　監事　）　　　　　　　　　　　　　　　様へ買入確認"]
[null,null,"買入額　　　　　　　　　　　万円",null,null,null,null,null,null,null,"／",null,"残高　　　　　　　　　　　万円　"]

{"sheet":"プルダウンリスト","index":2,"n_rows":33,"n_cols":6,"rows_kept":33,"cut":false,"hidden":true,"merged":[]}
[]
[]
[null,2025,1,1,null,"1.買入請求（中途換金）の実施を決定した総会の議事録等を提出する。"]
[null,2026,2,2,null,"2.会計担当役員等（下欄に記入）への電話による意思確認を希望する。"]
[null,2027,3,3]
[null,2028,4,4,null,"1.全部"]
[null,2029,5,5,null,"2.一部"]
[null,2030,6,6]
[null,2031,7,7,null,"今後の積立継続を希望する"]
[null,2032,8,8,null,"今後の積立継続を希望しない\n（積立用書類の送付は不要）"]
[null,2033,9,9]
[null,2034,10,10,null,"１．共用部分の修繕工事費用に充てる。"]
[null,2035,11,11,null,"２．共用部分の修繕工事に係る借入金の返済に充てる。"]
[null,null,12,12,null,"３．その他"]
[null,null,null,13]
[null,null,null,14]
[null,null,null,15]
[null,null,null,16]
[null,null,null,17]
[null,null,null,18]
[null,null,null,19]
[null,null,null,20]
[null,null,null,21]
[null,null,null,22]
[null,null,null,23]
[null,null,null,24]
[null,null,null,25]
[null,null,null,26]
[null,null,null,27]
[null,null,null,28]
[null,null,null,29]
[null,null,null,30]
[null,null,null,31]

{"sheet":"郵便番号バックデータ","index":3,"n_rows":948,"n_cols":3,"rows_kept":948,"cut":false,"hidden":true,"merged":[]}
["060","北海道","ﾎｯｶｲﾄﾞｳ"]
["064","北海道","ﾎｯｶｲﾄﾞｳ"]
["001","北海道","ﾎｯｶｲﾄﾞｳ"]
["002","北海道","ﾎｯｶｲﾄﾞｳ"]
["065","北海道","ﾎｯｶｲﾄﾞｳ"]
["007","北海道","ﾎｯｶｲﾄﾞｳ"]
["003","北海道","ﾎｯｶｲﾄﾞｳ"]
["062","北海道","ﾎｯｶｲﾄﾞｳ"]
["005","北海道","ﾎｯｶｲﾄﾞｳ"]
["061","北海道","ﾎｯｶｲﾄﾞｳ"]
["063","北海道","ﾎｯｶｲﾄﾞｳ"]
["004","北海道","ﾎｯｶｲﾄﾞｳ"]
["006","北海道","ﾎｯｶｲﾄﾞｳ"]
["040","北海道","ﾎｯｶｲﾄﾞｳ"]
["041","北海道","ﾎｯｶｲﾄﾞｳ"]
["042","北海道","ﾎｯｶｲﾄﾞｳ"]
["047","北海道","ﾎｯｶｲﾄﾞｳ"]
["048","北海道","ﾎｯｶｲﾄﾞｳ"]
["070","北海道","ﾎｯｶｲﾄﾞｳ"]
["079","北海道","ﾎｯｶｲﾄﾞｳ"]
["071","北海道","ﾎｯｶｲﾄﾞｳ"]
["078","北海道","ﾎｯｶｲﾄﾞｳ"]
["074","北海道","ﾎｯｶｲﾄﾞｳ"]
["050","北海道","ﾎｯｶｲﾄﾞｳ"]
["051","北海道","ﾎｯｶｲﾄﾞｳ"]
["085","北海道","ﾎｯｶｲﾄﾞｳ"]
["084","北海道","ﾎｯｶｲﾄﾞｳ"]
["088","北海道","ﾎｯｶｲﾄﾞｳ"]
["080","北海道","ﾎｯｶｲﾄﾞｳ"]
["089","北海道","ﾎｯｶｲﾄﾞｳ"]
["090","北海道","ﾎｯｶｲﾄﾞｳ"]
["099","北海道","ﾎｯｶｲﾄﾞｳ"]
["093","北海道","ﾎｯｶｲﾄﾞｳ"]
["091","北海道","ﾎｯｶｲﾄﾞｳ"]
["068","北海道","ﾎｯｶｲﾄﾞｳ"]
["069","北海道","ﾎｯｶｲﾄﾞｳ"]
["077","北海道","ﾎｯｶｲﾄﾞｳ"]
["053","北海道","ﾎｯｶｲﾄﾞｳ"]
["059","北海道","ﾎｯｶｲﾄﾞｳ"]
["066","北海道","ﾎｯｶｲﾄﾞｳ"]
["097","北海道","ﾎｯｶｲﾄﾞｳ"]
["098","北海道","ﾎｯｶｲﾄﾞｳ"]
["072","北海道","ﾎｯｶｲﾄﾞｳ"]
["075","北海道","ﾎｯｶｲﾄﾞｳ"]
["076","北海道","ﾎｯｶｲﾄﾞｳ"]
["067","北海道","ﾎｯｶｲﾄﾞｳ"]
["094","北海道","ﾎｯｶｲﾄﾞｳ"]
["095","北海道","ﾎｯｶｲﾄﾞｳ"]
["096","北海道","ﾎｯｶｲﾄﾞｳ"]
["087","北海道","ﾎｯｶｲﾄﾞｳ"]
["086","北海道","ﾎｯｶｲﾄﾞｳ"]
["073","北海道","ﾎｯｶｲﾄﾞｳ"]
["052","北海道","ﾎｯｶｲﾄﾞｳ"]
["044","北海道","ﾎｯｶｲﾄﾞｳ"]
["049","北海道","ﾎｯｶｲﾄﾞｳ"]
["043","北海道","ﾎｯｶｲﾄﾞｳ"]
["045","北海道","ﾎｯｶｲﾄﾞｳ"]
["046","北海道","ﾎｯｶｲﾄﾞｳ"]
["092","北海道","ﾎｯｶｲﾄﾞｳ"]
["054","北海道","ﾎｯｶｲﾄﾞｳ"]
["055","北海道","ﾎｯｶｲﾄﾞｳ"]
["057","北海道","ﾎｯｶｲﾄﾞｳ"]
["058","北海道","ﾎｯｶｲﾄﾞｳ"]
["056","北海道","ﾎｯｶｲﾄﾞｳ"]
["081","北海道","ﾎｯｶｲﾄﾞｳ"]
["082","北海道","ﾎｯｶｲﾄﾞｳ"]
["083","北海道","ﾎｯｶｲﾄﾞｳ"]
["038","青森県","ｱｵﾓﾘｹﾝ"]
["030","青森県","ｱｵﾓﾘｹﾝ"]
["039","青森県","ｱｵﾓﾘｹﾝ"]
["036","青森県","ｱｵﾓﾘｹﾝ"]
["031","青森県","ｱｵﾓﾘｹﾝ"]
["037","青森県","ｱｵﾓﾘｹﾝ"]
["034","青森県","ｱｵﾓﾘｹﾝ"]
["033","青森県","ｱｵﾓﾘｹﾝ"]
["035","青森県","ｱｵﾓﾘｹﾝ"]
["020","岩手県","ｲﾜﾃｹﾝ"]
["028","岩手県","ｲﾜﾃｹﾝ"]
["027","岩手県","ｲﾜﾃｹﾝ"]
["022","岩手県","ｲﾜﾃｹﾝ"]
["025","岩手県","ｲﾜﾃｹﾝ"]
["024","岩手県","ｲﾜﾃｹﾝ"]
["021","岩手県","ｲﾜﾃｹﾝ"]
["029","岩手県","ｲﾜﾃｹﾝ"]
["026","岩手県","ｲﾜﾃｹﾝ"]
["023","岩手県","ｲﾜﾃｹﾝ"]
["980","宮城県","ﾐﾔｷﾞｹﾝ"]
["981","宮城県","ﾐﾔｷﾞｹﾝ"]
["989","宮城県","ﾐﾔｷﾞｹﾝ"]
["982","宮城県","ﾐﾔｷﾞｹﾝ"]
["983","宮城県","ﾐﾔｷﾞｹﾝ"]
["985","宮城県","ﾐﾔｷﾞｹﾝ"]
["984","宮城県","ﾐﾔｷﾞｹﾝ"]
["986","宮城県","ﾐﾔｷﾞｹﾝ"]
["987","宮城県","ﾐﾔｷﾞｹﾝ"]
["988","宮城県","ﾐﾔｷﾞｹﾝ"]
["010","秋田県","ｱｷﾀｹﾝ"]
["011","秋田県","ｱｷﾀｹﾝ"]
["018","秋田県","ｱｷﾀｹﾝ"]
["019","秋田県","ｱｷﾀｹﾝ"]
["016","秋田県","ｱｷﾀｹﾝ"]
["013","秋田県","ｱｷﾀｹﾝ"]
["017","秋田県","ｱｷﾀｹﾝ"]
["012","秋田県","ｱｷﾀｹﾝ"]
["015","秋田県","ｱｷﾀｹﾝ"]
["014","秋田県","ｱｷﾀｹﾝ"]
["990","山形県","ﾔﾏｶﾞﾀｹﾝ"]
["999","山形県","ﾔﾏｶﾞﾀｹﾝ"]
["992","山形県","ﾔﾏｶﾞﾀｹﾝ"]
["997","山形県","ﾔﾏｶﾞﾀｹﾝ"]
["998","山形県","ﾔﾏｶﾞﾀｹﾝ"]
["996","山形県","ﾔﾏｶﾞﾀｹﾝ"]
["991","山形県","ﾔﾏｶﾞﾀｹﾝ"]
["995","山形県","ﾔﾏｶﾞﾀｹﾝ"]
["993","山形県","ﾔﾏｶﾞﾀｹﾝ"]
["994","山形県","ﾔﾏｶﾞﾀｹﾝ"]
["960","福島県","ﾌｸｼﾏｹﾝ"]
["965","福島県","ﾌｸｼﾏｹﾝ"]
["969","福島県","ﾌｸｼﾏｹﾝ"]
["963","福島県","ﾌｸｼﾏｹﾝ"]
["970","福島県","ﾌｸｼﾏｹﾝ"]
["974","福島県","ﾌｸｼﾏｹﾝ"]
["971","福島県","ﾌｸｼﾏｹﾝ"]
["973","福島県","ﾌｸｼﾏｹﾝ"]
["979","福島県","ﾌｸｼﾏｹﾝ"]
["972","福島県","ﾌｸｼﾏｹﾝ"]
["961","福島県","ﾌｸｼﾏｹﾝ"]
["962","福島県","ﾌｸｼﾏｹﾝ"]
["966","福島県","ﾌｸｼﾏｹﾝ"]
["976","福島県","ﾌｸｼﾏｹﾝ"]
["964","福島県","ﾌｸｼﾏｹﾝ"]
["975","福島県","ﾌｸｼﾏｹﾝ"]
["967","福島県","ﾌｸｼﾏｹﾝ"]
["968","福島県","ﾌｸｼﾏｹﾝ"]
["310","茨城県","ｲﾊﾞﾗｷｹﾝ"]
["319","茨城県","ｲﾊﾞﾗｷｹﾝ"]
["311","茨城県","ｲﾊﾞﾗｷｹﾝ"]
["317","茨城県","ｲﾊﾞﾗｷｹﾝ"]
["316","茨城県","ｲﾊﾞﾗｷｹﾝ"]
["300","茨城県","ｲﾊﾞﾗｷｹﾝ"]
["306","茨城県","ｲﾊﾞﾗｷｹﾝ"]
["315","茨城県","ｲﾊﾞﾗｷｹﾝ"]
["307","茨城県","ｲﾊﾞﾗｷｹﾝ"]
["301","茨城県","ｲﾊﾞﾗｷｹﾝ"]
["304","茨城県","ｲﾊﾞﾗｷｹﾝ"]
["303","茨城県","ｲﾊﾞﾗｷｹﾝ"]
["313","茨城県","ｲﾊﾞﾗｷｹﾝ"]
["318","茨城県","ｲﾊﾞﾗｷｹﾝ"]
["309","茨城県","ｲﾊﾞﾗｷｹﾝ"]
["302","茨城県","ｲﾊﾞﾗｷｹﾝ"]
["305","茨城県","ｲﾊﾞﾗｷｹﾝ"]
["312","茨城県","ｲﾊﾞﾗｷｹﾝ"]
["314","茨城県","ｲﾊﾞﾗｷｹﾝ"]
["308","茨城県","ｲﾊﾞﾗｷｹﾝ"]
["321","栃木県","ﾄﾁｷﾞｹﾝ"]
["329","栃木県","ﾄﾁｷﾞｹﾝ"]
["320","栃木県","ﾄﾁｷﾞｹﾝ"]
["326","栃木県","ﾄﾁｷﾞｹﾝ"]
["328","栃木県","ﾄﾁｷﾞｹﾝ"]
["322","栃木県","ﾄﾁｷﾞｹﾝ"]
["323","栃木県","ﾄﾁｷﾞｹﾝ"]
["327","栃木県","ﾄﾁｷﾞｹﾝ"]
["324","栃木県","ﾄﾁｷﾞｹﾝ"]
["325","栃木県","ﾄﾁｷﾞｹﾝ"]
["371","群馬県","ｸﾞﾝﾏｹﾝ"]
["370","群馬県","ｸﾞﾝﾏｹﾝ"]
["379","群馬県","ｸﾞﾝﾏｹﾝ"]
["376","群馬県","ｸﾞﾝﾏｹﾝ"]
["372","群馬県","ｸﾞﾝﾏｹﾝ"]
["373","群馬県","ｸﾞﾝﾏｹﾝ"]
["378","群馬県","ｸﾞﾝﾏｹﾝ"]
["374","群馬県","ｸﾞﾝﾏｹﾝ"]
["377","群馬県","ｸﾞﾝﾏｹﾝ"]
["375","群馬県","ｸﾞﾝﾏｹﾝ"]
["331","埼玉県","ｻｲﾀﾏｹﾝ"]
["330","埼玉県","ｻｲﾀﾏｹﾝ"]
["337","埼玉県","ｻｲﾀﾏｹﾝ"]
["338","埼玉県","ｻｲﾀﾏｹﾝ"]
["336","埼玉県","ｻｲﾀﾏｹﾝ"]
["339","埼玉県","ｻｲﾀﾏｹﾝ"]
["349","埼玉県","ｻｲﾀﾏｹﾝ"]
["350","埼玉県","ｻｲﾀﾏｹﾝ"]
["360","埼玉県","ｻｲﾀﾏｹﾝ"]
["369","埼玉県","ｻｲﾀﾏｹﾝ"]
["332","埼玉県","ｻｲﾀﾏｹﾝ"]
["334","埼玉県","ｻｲﾀﾏｹﾝ"]
["333","埼玉県","ｻｲﾀﾏｹﾝ"]
["361","埼玉県","ｻｲﾀﾏｹﾝ"]
["368","埼玉県","ｻｲﾀﾏｹﾝ"]
["359","埼玉県","ｻｲﾀﾏｹﾝ"]
["357","埼玉県","ｻｲﾀﾏｹﾝ"]
["347","埼玉県","ｻｲﾀﾏｹﾝ"]
["367","埼玉県","ｻｲﾀﾏｹﾝ"]
["355","埼玉県","ｻｲﾀﾏｹﾝ"]
["344","埼玉県","ｻｲﾀﾏｹﾝ"]
["348","埼玉県","ｻｲﾀﾏｹﾝ"]
["365","埼玉県","ｻｲﾀﾏｹﾝ"]
["366","埼玉県","ｻｲﾀﾏｹﾝ"]
["362","埼玉県","ｻｲﾀﾏｹﾝ"]
["340","埼玉県","ｻｲﾀﾏｹﾝ"]
["343","埼玉県","ｻｲﾀﾏｹﾝ"]
["335","埼玉県","ｻｲﾀﾏｹﾝ"]
["358","埼玉県","ｻｲﾀﾏｹﾝ"]
["351","埼玉県","ｻｲﾀﾏｹﾝ"]
["353","埼玉県","ｻｲﾀﾏｹﾝ"]
["352","埼玉県","ｻｲﾀﾏｹﾝ"]
["363","埼玉県","ｻｲﾀﾏｹﾝ"]
["346","埼玉県","ｻｲﾀﾏｹﾝ"]
["364","埼玉県","ｻｲﾀﾏｹﾝ"]
["354","埼玉県","ｻｲﾀﾏｹﾝ"]
["341","埼玉県","ｻｲﾀﾏｹﾝ"]
["342","埼玉県","ｻｲﾀﾏｹﾝ"]
["356","埼玉県","ｻｲﾀﾏｹﾝ"]
["345","埼玉県","ｻｲﾀﾏｹﾝ"]
["260","千葉県","ﾁﾊﾞｹﾝ"]
["262","千葉県","ﾁﾊﾞｹﾝ"]
["263","千葉県","ﾁﾊﾞｹﾝ"]
["264","千葉県","ﾁﾊﾞｹﾝ"]
["265","千葉県","ﾁﾊﾞｹﾝ"]
["266","千葉県","ﾁﾊﾞｹﾝ"]
["267","千葉県","ﾁﾊﾞｹﾝ"]
["261","千葉県","ﾁﾊﾞｹﾝ"]
["288","千葉県","ﾁﾊﾞｹﾝ"]
["272","千葉県","ﾁﾊﾞｹﾝ"]
["273","千葉県","ﾁﾊﾞｹﾝ"]
["274","千葉県","ﾁﾊﾞｹﾝ"]
["270","千葉県","ﾁﾊﾞｹﾝ"]
["294","千葉県","ﾁﾊﾞｹﾝ"]
["292","千葉県","ﾁﾊﾞｹﾝ"]
["299","千葉県","ﾁﾊﾞｹﾝ"]
["271","千葉県","ﾁﾊﾞｹﾝ"]
["278","千葉県","ﾁﾊﾞｹﾝ"]
["297","千葉県","ﾁﾊﾞｹﾝ"]
["286","千葉県","ﾁﾊﾞｹﾝ"]
["289","千葉県","ﾁﾊﾞｹﾝ"]
["287","千葉県","ﾁﾊﾞｹﾝ"]
["282","千葉県","ﾁﾊﾞｹﾝ"]
["285","千葉県","ﾁﾊﾞｹﾝ"]
["283","千葉県","ﾁﾊﾞｹﾝ"]
["275","千葉県","ﾁﾊﾞｹﾝ"]
["277","千葉県","ﾁﾊﾞｹﾝ"]
["290","千葉県","ﾁﾊﾞｹﾝ"]
["276","千葉県","ﾁﾊﾞｹﾝ"]
["296","千葉県","ﾁﾊﾞｹﾝ"]
["293","千葉県","ﾁﾊﾞｹﾝ"]
["279","千葉県","ﾁﾊﾞｹﾝ"]
["284","千葉県","ﾁﾊﾞｹﾝ"]
["295","千葉県","ﾁﾊﾞｹﾝ"]
["298","千葉県","ﾁﾊﾞｹﾝ"]
["100","東京都","ﾄｳｷｮｳﾄ"]
["102","東京都","ﾄｳｷｮｳﾄ"]
["101","東京都","ﾄｳｷｮｳﾄ"]
["103","東京都","ﾄｳｷｮｳﾄ"]
["104","東京都","ﾄｳｷｮｳﾄ"]
["105","東京都","ﾄｳｷｮｳﾄ"]
["107","東京都","ﾄｳｷｮｳﾄ"]
["106","東京都","ﾄｳｷｮｳﾄ"]
["108","東京都","ﾄｳｷｮｳﾄ"]
["135","東京都","ﾄｳｷｮｳﾄ"]
["160","東京都","ﾄｳｷｮｳﾄ"]
["162","東京都","ﾄｳｷｮｳﾄ"]
["169","東京都","ﾄｳｷｮｳﾄ"]
["161","東京都","ﾄｳｷｮｳﾄ"]
["163","東京都","ﾄｳｷｮｳﾄ"]
["112","東京都","ﾄｳｷｮｳﾄ"]
["113","東京都","ﾄｳｷｮｳﾄ"]
["110","東京都","ﾄｳｷｮｳﾄ"]
["111","東京都","ﾄｳｷｮｳﾄ"]
["130","東京都","ﾄｳｷｮｳﾄ"]
["131","東京都","ﾄｳｷｮｳﾄ"]
["136","東京都","ﾄｳｷｮｳﾄ"]
["140","東京都","ﾄｳｷｮｳﾄ"]
["142","東京都","ﾄｳｷｮｳﾄ"]
["141","東京都","ﾄｳｷｮｳﾄ"]
["152","東京都","ﾄｳｷｮｳﾄ"]
["153","東京都","ﾄｳｷｮｳﾄ"]
["144","東京都","ﾄｳｷｮｳﾄ"]
["146","東京都","ﾄｳｷｮｳﾄ"]
["145","東京都","ﾄｳｷｮｳﾄ"]
["143","東京都","ﾄｳｷｮｳﾄ"]
["154","東京都","ﾄｳｷｮｳﾄ"]
["156","東京都","ﾄｳｷｮｳﾄ"]
["157","東京都","ﾄｳｷｮｳﾄ"]
["158","東京都","ﾄｳｷｮｳﾄ"]
["155","東京都","ﾄｳｷｮｳﾄ"]
["150","東京都","ﾄｳｷｮｳﾄ"]
["151","東京都","ﾄｳｷｮｳﾄ"]
["164","東京都","ﾄｳｷｮｳﾄ"]
["165","東京都","ﾄｳｷｮｳﾄ"]
["166","東京都","ﾄｳｷｮｳﾄ"]
["167","東京都","ﾄｳｷｮｳﾄ"]
["168","東京都","ﾄｳｷｮｳﾄ"]
["170","東京都","ﾄｳｷｮｳﾄ"]
["171","東京都","ﾄｳｷｮｳﾄ"]
["114","東京都","ﾄｳｷｮｳﾄ"]
["115","東京都","ﾄｳｷｮｳﾄ"]
["116","東京都","ﾄｳｷｮｳﾄ"]
["174","東京都","ﾄｳｷｮｳﾄ"]
["175","東京都","ﾄｳｷｮｳﾄ"]
["173","東京都","ﾄｳｷｮｳﾄ"]
["176","東京都","ﾄｳｷｮｳﾄ"]
["179","東京都","ﾄｳｷｮｳﾄ"]
["178","東京都","ﾄｳｷｮｳﾄ"]
["177","東京都","ﾄｳｷｮｳﾄ"]
["120","東京都","ﾄｳｷｮｳﾄ"]
["121","東京都","ﾄｳｷｮｳﾄ"]
["123","東京都","ﾄｳｷｮｳﾄ"]
["124","東京都","ﾄｳｷｮｳﾄ"]
["125","東京都","ﾄｳｷｮｳﾄ"]
["132","東京都","ﾄｳｷｮｳﾄ"]
["134","東京都","ﾄｳｷｮｳﾄ"]
["133","東京都","ﾄｳｷｮｳﾄ"]
["192","東京都","ﾄｳｷｮｳﾄ"]
["193","東京都","ﾄｳｷｮｳﾄ"]
["190","東京都","ﾄｳｷｮｳﾄ"]
["180","東京都","ﾄｳｷｮｳﾄ"]
["181","東京都","ﾄｳｷｮｳﾄ"]
["198","東京都","ﾄｳｷｮｳﾄ"]
["183","東京都","ﾄｳｷｮｳﾄ"]
["196","東京都","ﾄｳｷｮｳﾄ"]
["182","東京都","ﾄｳｷｮｳﾄ"]
["194","東京都","ﾄｳｷｮｳﾄ"]
["195","東京都","ﾄｳｷｮｳﾄ"]
["184","東京都","ﾄｳｷｮｳﾄ"]
["187","東京都","ﾄｳｷｮｳﾄ"]
["191","東京都","ﾄｳｷｮｳﾄ"]
["189","東京都","ﾄｳｷｮｳﾄ"]
["185","東京都","ﾄｳｷｮｳﾄ"]
["186","東京都","ﾄｳｷｮｳﾄ"]
["197","東京都","ﾄｳｷｮｳﾄ"]
["201","東京都","ﾄｳｷｮｳﾄ"]
["207","東京都","ﾄｳｷｮｳﾄ"]
["204","東京都","ﾄｳｷｮｳﾄ"]
["203","東京都","ﾄｳｷｮｳﾄ"]
["208","東京都","ﾄｳｷｮｳﾄ"]
["206","東京都","ﾄｳｷｮｳﾄ"]
["205","東京都","ﾄｳｷｮｳﾄ"]
["202","東京都","ﾄｳｷｮｳﾄ"]
["188","東京都","ﾄｳｷｮｳﾄ"]
["230","神奈川県","ｶﾅｶﾞﾜｹﾝ"]
["221","神奈川県","ｶﾅｶﾞﾜｹﾝ"]
["220","神奈川県","ｶﾅｶﾞﾜｹﾝ"]
["231","神奈川県","ｶﾅｶﾞﾜｹﾝ"]
["232","神奈川県","ｶﾅｶﾞﾜｹﾝ"]
["240","神奈川県","ｶﾅｶﾞﾜｹﾝ"]
["235","神奈川県","ｶﾅｶﾞﾜｹﾝ"]
["236","神奈川県","ｶﾅｶﾞﾜｹﾝ"]
["222","神奈川県","ｶﾅｶﾞﾜｹﾝ"]
["223","神奈川県","ｶﾅｶﾞﾜｹﾝ"]
["244","神奈川県","ｶﾅｶﾞﾜｹﾝ"]
["245","神奈川県","ｶﾅｶﾞﾜｹﾝ"]
["233","神奈川県","ｶﾅｶﾞﾜｹﾝ"]
["234","神奈川県","ｶﾅｶﾞﾜｹﾝ"]
["241","神奈川県","ｶﾅｶﾞﾜｹﾝ"]
["226","神奈川県","ｶﾅｶﾞﾜｹﾝ"]
["246","神奈川県","ｶﾅｶﾞﾜｹﾝ"]
["247","神奈川県","ｶﾅｶﾞﾜｹﾝ"]
["227","神奈川県","ｶﾅｶﾞﾜｹﾝ"]
["225","神奈川県","ｶﾅｶﾞﾜｹﾝ"]
["224","神奈川県","ｶﾅｶﾞﾜｹﾝ"]
["210","神奈川県","ｶﾅｶﾞﾜｹﾝ"]
["212","神奈川県","ｶﾅｶﾞﾜｹﾝ"]
["211","神奈川県","ｶﾅｶﾞﾜｹﾝ"]
["213","神奈川県","ｶﾅｶﾞﾜｹﾝ"]
["214","神奈川県","ｶﾅｶﾞﾜｹﾝ"]
["216","神奈川県","ｶﾅｶﾞﾜｹﾝ"]
["215","神奈川県","ｶﾅｶﾞﾜｹﾝ"]
["252","神奈川県","ｶﾅｶﾞﾜｹﾝ"]
["238","神奈川県","ｶﾅｶﾞﾜｹﾝ"]
["239","神奈川県","ｶﾅｶﾞﾜｹﾝ"]
["237","神奈川県","ｶﾅｶﾞﾜｹﾝ"]
["254","神奈川県","ｶﾅｶﾞﾜｹﾝ"]
["259","神奈川県","ｶﾅｶﾞﾜｹﾝ"]
["248","神奈川県","ｶﾅｶﾞﾜｹﾝ"]
["251","神奈川県","ｶﾅｶﾞﾜｹﾝ"]
["250","神奈川県","ｶﾅｶﾞﾜｹﾝ"]
["256","神奈川県","ｶﾅｶﾞﾜｹﾝ"]
["253","神奈川県","ｶﾅｶﾞﾜｹﾝ"]
["249","神奈川県","ｶﾅｶﾞﾜｹﾝ"]
["257","神奈川県","ｶﾅｶﾞﾜｹﾝ"]
["243","神奈川県","ｶﾅｶﾞﾜｹﾝ"]
["242","神奈川県","ｶﾅｶﾞﾜｹﾝ"]
["255","神奈川県","ｶﾅｶﾞﾜｹﾝ"]
["258","神奈川県","ｶﾅｶﾞﾜｹﾝ"]
["950","新潟県","ﾆｲｶﾞﾀｹﾝ"]
["951","新潟県","ﾆｲｶﾞﾀｹﾝ"]
["956","新潟県","ﾆｲｶﾞﾀｹﾝ"]
["959","新潟県","ﾆｲｶﾞﾀｹﾝ"]
["953","新潟県","ﾆｲｶﾞﾀｹﾝ"]
["940","新潟県","ﾆｲｶﾞﾀｹﾝ"]
["954","新潟県","ﾆｲｶﾞﾀｹﾝ"]
["949","新潟県","ﾆｲｶﾞﾀｹﾝ"]
["947","新潟県","ﾆｲｶﾞﾀｹﾝ"]
["955","新潟県","ﾆｲｶﾞﾀｹﾝ"]
["945","新潟県","ﾆｲｶﾞﾀｹﾝ"]
["957","新潟県","ﾆｲｶﾞﾀｹﾝ"]
["948","新潟県","ﾆｲｶﾞﾀｹﾝ"]
["942","新潟県","ﾆｲｶﾞﾀｹﾝ"]
["958","新潟県","ﾆｲｶﾞﾀｹﾝ"]
["941","新潟県","ﾆｲｶﾞﾀｹﾝ"]
{"$rows_left_out":548}